program: Gaussian 09
title: 000170524
version: EM64L-G09RevD.01
frameworkgroup: C1[X(C19H23NO3)]
method: RPBEPBE
basis: SDD
operation: Freq
keyword: #p
keyword: freq=noraman
keyword: PBEPBE/SDD
title: #p freq=noraman PBEPBE/SDD
converged: YES YES NO NO
title: Mulliken charges:
elementType: O O O N C C C C C C C C C C C C C C C C C C C H H H H H H H H H H H H H H H H H H H H H H H
charge: -0.302660 -0.301242 -0.270365 -0.291731 -0.276648 0.361165 0.336167 -0.538337 -0.492625 -0.629410 -0.560108 -0.540192 0.511160 0.187286 0.191960 -0.432606 -0.358479 -0.354227 -0.364825 0.313687 -0.530616 -0.530911 -0.538056 0.245907 0.220646 0.218033 0.227848 0.219159 0.230547 0.226402 0.261219 0.257737 0.255096 0.227872 0.257886 0.244735 0.234365 0.253063 0.221194 0.228159 0.254042 0.220601 0.228001 0.218430 0.241952 0.218717
chargesum: 0.00000
title: Mulliken charges with hydrogens summed into heavy atoms:
elementType: O O O N C C C C C C C C C C C C C C C C C C C
charge: -0.302660 -0.301242 -0.270365 -0.030512 -0.030741 0.361165 0.336167 -0.099658 -0.045619 -0.172462 -0.302371 -0.285096 0.511160 0.187286 0.191960 -0.204734 -0.100593 -0.109492 -0.130460 0.313687 0.171801 0.171734 0.141043
polarizability: 3.30359130e+02 8.83572373e+00 2.29975361e+02 -1.12167448e+01 4.85212388e+00 1.28831067e+02
1716.lowfreq: -10.0284 -4.6650 -0.0011 -0.0006 0.0005 3.6071 12.2325 24.9981 34.6959
frequency: 8.2551 24.8632 34.6470 56.0322 61.7015 94.1691 102.8712 104.8056 118.7315 139.3961 167.6159 170.5901 172.9257 195.6912 200.8014 240.4133 245.2966 263.0478 280.9841 288.6927 306.0301 334.6339 355.2887 382.9855 409.9975 413.8948 421.1794 445.0909 464.4046 484.8479 502.3626 512.6811 536.9979 576.3094 630.9180 634.5135 640.8554 657.4224 705.5046 714.5057 720.9888 730.0669 743.0729 786.8902 807.3634 819.5779 842.4210 850.5891 871.4522 893.0875 903.0782 909.5095 933.0764 952.8578 956.4068 959.1897 975.8564 990.7238 1004.0089 1007.5085 1068.2475 1079.4148 1106.7694 1112.0300 1113.1661 1115.5550 1129.8579 1148.1633 1150.0537 1155.9198 1162.0364 1173.1320 1176.4698 1177.9977 1199.4919 1214.5764 1225.4869 1227.3962 1237.4370 1259.3377 1267.9507 1302.8088 1307.7516 1313.6535 1338.2706 1359.9180 1372.3364 1382.2836 1388.3792 1413.9366 1423.8007 1435.5772 1442.1088 1443.5859 1454.6251 1457.5753 1458.9280 1460.9381 1465.7120 1472.2576 1474.2596 1478.0503 1485.3619 1488.6355 1500.4234 1566.1173 1583.2810 1614.0806 1621.8297 2954.8386 2954.9858 2969.2509 2971.0574 2987.4256 2990.4442 3000.7796 3017.7181 3040.3279 3052.4103 3054.4696 3065.6297 3067.3989 3115.8843 3118.5516 3118.7716 3120.0094 3130.0784 3136.4695 3142.7053 3161.5361 3166.1751 3455.5932
redmass: 3.6995 4.6581 4.3535 4.1875 3.4850 3.2105 3.5149 3.1558 3.5964 3.6958 1.1180 3.0730 1.1275 2.9464 3.2633 1.4418 2.3078 4.4847 3.0974 5.0494 3.4638 2.9356 3.6648 3.3012 4.3419 2.9383 4.7007 3.2030 2.5833 3.6801 3.9434 3.9100 2.6660 3.3599 4.0846 4.0103 2.4731 4.4401 3.8032 5.8323 3.9147 4.1334 3.2356 3.4643 1.8072 1.5882 2.3203 2.6202 2.0037 1.6106 1.7382 2.9122 1.4800 3.8279 1.4450 3.4452 2.2066 8.6482 2.7717 2.7496 2.5172 2.8030 1.4569 1.2613 1.2448 1.2428 2.8615 1.4381 1.5233 1.3517 1.3673 1.4908 1.7653 1.6510 1.3660 1.9929 1.4456 3.5389 1.3538 1.2708 4.1924 1.3479 1.4256 1.5517 1.3606 2.2114 2.5203 4.3798 2.7981 3.1795 1.1763 1.1729 1.2549 1.2226 1.1542 1.0543 1.0746 1.0951 1.0505 1.0953 1.0811 1.0571 2.8669 1.0591 2.4673 8.2838 7.0806 7.1375 6.5026 1.0425 1.0535 1.0310 1.0313 1.0667 1.0652 1.0784 1.0934 1.1036 1.0998 1.1032 1.1033 1.1034 1.0893 1.1028 1.1027 1.0990 1.0907 1.0916 1.0875 1.0946 1.0960 1.0751
irintensity: 0.7355 0.3623 0.9224 0.6610 0.2207 7.3526 2.9378 4.9446 2.9603 3.1766 0.2365 1.5519 0.1211 7.2453 4.1307 0.3388 2.4516 3.6942 4.1864 4.8646 4.2762 0.6664 2.2429 6.2243 9.1345 0.2131 0.2419 5.3825 8.9598 3.2727 2.1472 21.6446 55.5877 11.3458 48.1375 65.2225 23.7675 12.6815 8.0211 2.6085 1.3736 8.4418 6.1435 21.5826 22.1492 11.1882 6.0633 18.3005 0.3646 4.6523 56.6097 4.7509 1.0347 42.1401 0.8678 55.8384 7.8077 42.6259 11.2713 11.5269 33.5769 39.0237 11.2266 0.2567 12.9913 4.7186 33.5117 11.3094 6.3549 0.3017 14.1999 16.0677 40.6229 66.4211 2.4532 39.8138 4.0835 142.0072 12.7165 7.0878 151.7703 1.5568 2.5123 6.8370 0.4083 3.1457 7.1131 17.8201 11.0789 0.0923 0.3941 12.7646 8.9977 6.9005 9.9568 14.2970 5.8623 6.0699 13.4249 12.7118 67.5316 5.5232 154.8387 35.7163 142.5868 1.1282 9.7982 1.4060 37.9537 51.3848 62.8121 96.6597 61.0543 17.7185 25.5952 39.3332 49.7166 53.2826 35.9860 27.8302 31.9479 24.2885 20.0442 23.6657 29.4327 30.8795 10.6233 4.5713 12.5323 16.1513 3.7347 1.0309
temp: 298.150 k
press: 1.00000 atm
elementType: 8 8 8 7 6 6 6 6 6 6 6 6 6 6 6 6 6 6 6 6 6 6 6 1 1 1 1 1 1 1 1 1 1 1 1 1 1 1 1 1 1 1 1 1 1 1
symmnumber: 1
zpe: 996245.1 jmol-1
zpe.correction: 0.379450 hartree
zpe.thermalcorrener: 0.401957 hartree
zpe.thermalcorrenthalpy: 0.402901 hartree
zpe.thermalcorrgfe: 0.325633 hartree
zpe.sumelectzpe: -1016.480665 hartree
zpe.sumelectthermal: -1016.458158 hartree
zpe.sumelectthermalent: -1016.457214 hartree
zpe.sumelectthermalfe: -1016.534482 hartree
dipole: -0.8020 2.1855 -0.4817
dipole: 2.3773
quadrupole: -119.9375 -125.8298 -137.4440
quadrupole: 13.4416 1.0697 -4.4386
quadrupole: 7.7996 1.9073 -9.7069 13.4416 1.0697 -4.4386
hfenergy: -1016.8601149 hartree
pointgroup: C01 [X(C19H23N1O3)]
dipole: 0.312213 -0.8726248 -0.1259415 debye
polarizability: 330.490213|9.2675177|228.6288162|9.814275|-12.3833047|130.0465286 unknown
InChI: InChI=1S/C19H23NO3/c1-21-15-6-4-13(5-7-15)10-17-16-12-19(23-3)18(22-2)11-14(16)8-9-20-17/h4-7,11-12,17,20H,8-10H2,1-3H3
charge 0 multiplicity 1
46 atoms
O  3.814601 2.244721 -0.489275
O  5.549377 -0.020915 0.198132
O  -6.488585 1.162439 -0.445111
N  -0.637756 -2.119482 -0.321541
C  -0.19657 -0.701793 -0.301482
C  1.330058 -0.536822 -0.161302
C  2.172234 -1.634456 0.17528
C  1.59943 -3.033648 0.381957
C  0.075217 -2.983837 0.644657
C  -0.956542 0.086827 0.825481
C  1.913586 0.738761 -0.363224
C  3.569946 -1.424418 0.278397
C  -2.423059 0.33204 0.512072
C  3.300359 0.946084 -0.246983
C  4.146385 -0.159845 0.056936
C  -2.876204 1.627421 0.140638
C  -3.378024 -0.713024 0.558032
C  -4.226331 1.873629 -0.173986
C  -4.738767 -0.487479 0.246703
C  -5.163812 0.813181 -0.120328
C  4.467451 2.870247 0.684376
C  6.253879 0.380253 -1.041749
C  -7.494356 0.101297 -0.395123
H  -0.505032 -0.251522 -1.265257
H  1.789482 -3.646767 -0.524154
H  2.122309 -3.539676 1.217317
H  -0.36115 -3.998331 0.60251
H  -0.111755 -2.592786 1.663159
H  -0.44488 1.054302 0.978652
H  -0.842653 -0.480937 1.769427
H  -0.627303 -2.513663 -1.270712
H  1.292246 1.60556 -0.618526
H  4.24066 -2.255754 0.525051
H  -2.160486 2.458625 0.102254
H  -3.039685 -1.720956 0.817145
H  -4.577257 2.871185 -0.456029
H  -5.44646 -1.320943 0.295921
H  5.296746 2.24214 1.057218
H  3.726763 3.029431 1.491257
H  4.846617 3.840116 0.327478
H  5.851799 1.330999 -1.436072
H  6.157126 -0.413244 -1.807333
H  7.31028 0.496093 -0.754655
H  -7.265311 -0.7086 -1.115703
H  -8.440831 0.587715 -0.674369
H  -7.581544 -0.326368 0.623262
