program: Gaussian 09
title: 000170512
version: EM64L-G09RevD.01
frameworkgroup: C1[X(C14H18N4)]
method: RPBEPBE
basis: SDD
operation: Freq
keyword: #pfreq=noraman
keyword: PBEPBE/SDD
title: #p freq=noraman PBEPBE/SDD
converged: YES YES NO NO
title: Mulliken charges:
elementType: N N N N C C C C C C C C C C C C C C H H H H H H H H H H H H H H H H H H
charge: -0.189619 -0.206489 -0.025771 -0.036225 -0.042463 0.029023 0.042638 -0.365023 -0.371477 -0.671335 -0.668599 -0.670222 0.113905 0.120887 -0.359900 -0.360330 -0.238675 -0.238816 0.223467 0.247973 0.202233 0.263440 0.210396 0.238371 0.224362 0.221267 0.216001 0.259068 0.214004 0.240916 0.223830 0.208637 0.248989 0.248969 0.223320 0.223247
chargesum: 0.00000
title: Mulliken charges with hydrogens summed into heavy atoms:
elementType: N N N N C C C C C C C C C C C C C C
charge: -0.189619 -0.206489 -0.025771 -0.036225 0.181004 0.029023 0.042638 0.085183 0.102360 0.012665 0.020474 0.003160 0.113905 0.120887 -0.110911 -0.111360 -0.015355 -0.015569
polarizability: 3.05777569e+02 4.78178116e-01 1.81732518e+02 1.91854569e+00 8.94204936e+00 1.01414264e+02
1716.lowfreq: -25.0321 -4.3351 0.0005 0.0007 0.0008 4.4274 7.6390 43.8730 56.5725
frequency: -22.7951 43.6812 56.5643 71.0936 75.3857 127.3718 131.2521 161.4156 185.9766 229.2676 241.6354 264.3299 271.7298 276.1206 312.0960 340.4984 369.2838 376.5117 419.9069 460.8253 484.0441 506.2966 519.5386 558.0562 568.0277 594.3355 617.2584 639.1001 694.8598 730.4015 759.2302 765.0757 777.1461 782.2636 786.0027 842.5463 869.7794 899.8203 935.2586 943.7782 947.9493 963.9546 977.9994 1019.8175 1043.9781 1071.8574 1078.1728 1093.1364 1098.3449 1103.2006 1108.6755 1147.3652 1173.5528 1176.4524 1215.9935 1223.3110 1231.2618 1253.2756 1283.4163 1308.4463 1327.1787 1341.7311 1354.4063 1357.4893 1367.4967 1381.9265 1382.8156 1384.4224 1393.2026 1411.7438 1452.0628 1456.8185 1461.8096 1466.7011 1469.1560 1470.7473 1471.0395 1475.9362 1483.5090 1487.2490 1550.8869 1573.5037 1591.0865 1630.2639 2875.2541 2983.2110 2986.5914 2987.6111 2987.9656 2991.5443 3044.0056 3057.0728 3080.2005 3083.5554 3086.8895 3096.2663 3102.4170 3107.5817 3126.0876 3140.1954 3154.3352 3166.1138
redmass: 2.5206 2.5675 3.2934 3.9618 3.4398 3.6207 5.1682 1.9787 1.2985 1.4151 1.1619 3.9194 1.8856 1.7455 4.0230 4.6987 3.4922 4.7586 4.8715 5.3088 3.4548 3.9547 4.5290 3.4148 3.7725 7.7117 4.7425 3.9375 5.8088 6.4021 1.7554 1.2730 1.3252 3.6098 1.7895 3.5329 1.5680 4.0362 2.7357 2.2865 1.3725 1.9930 1.3050 2.0080 2.2601 1.8552 2.1821 1.9450 1.8868 2.1823 2.1808 1.4948 1.9855 2.4978 2.8642 1.7686 1.8271 3.0139 1.6231 1.5216 1.6510 1.2316 1.3068 1.6365 2.6064 1.2592 1.2366 1.2260 2.2964 5.1388 1.5753 1.5163 1.2927 1.0816 1.3025 1.4034 1.2077 1.1127 1.0695 1.0543 6.1859 7.2618 9.6106 7.7404 1.0837 1.0362 1.0483 1.0561 1.0473 1.0418 1.1035 1.0981 1.0989 1.0997 1.0988 1.1013 1.1015 1.1018 1.0848 1.0892 1.0948 1.1004
irintensity: 0.1069 0.2671 1.6198 0.1340 3.5563 0.1659 0.9691 0.3339 0.8178 0.8695 0.0183 0.0717 0.1894 0.2150 3.6518 1.3702 1.4236 0.1255 0.8741 9.8726 2.1344 11.7959 9.1745 6.8613 0.4164 23.3270 2.6562 1.8441 2.4268 0.1047 6.8612 98.6634 0.5884 0.6706 9.3864 0.5553 0.0006 3.4081 3.3083 14.6369 3.6335 5.3216 0.0033 14.0081 6.1458 17.3749 2.4719 15.5013 8.7493 19.7618 1.9906 4.7636 3.6988 2.7340 26.2904 11.6726 53.7265 0.3409 2.6111 84.7217 14.3810 40.9832 36.5578 32.8161 15.1525 13.7805 45.2614 19.1547 24.5963 65.9582 34.1422 83.8753 3.3277 19.3266 107.1005 78.3559 15.4330 27.7690 5.3692 9.8630 40.2445 41.4954 570.1530 4.3822 120.5416 27.3868 38.0679 29.6600 41.1724 61.9788 7.2975 2.1181 44.1210 55.4083 7.1069 35.4590 23.3919 28.8851 1.1166 10.6511 27.0495 37.7972
temp: 298.150 k
press: 1.00000 atm
elementType: 7 7 7 7 6 6 6 6 6 6 6 6 6 6 6 6 6 6 1 1 1 1 1 1 1 1 1 1 1 1 1 1 1 1 1 1
symmnumber: 1
zpe: 783601.9 jmol-1
zpe.correction: 0.298458 hartree
zpe.thermalcorrener: 0.314531 hartree
zpe.thermalcorrenthalpy: 0.315475 hartree
zpe.thermalcorrgfe: 0.255034 hartree
zpe.sumelectzpe: -761.986970 hartree
zpe.sumelectthermal: -761.970897 hartree
zpe.sumelectthermalent: -761.969953 hartree
zpe.sumelectthermalfe: -762.030394 hartree
dipole: 5.5843 -0.0106 0.2893
dipole: 5.5918
quadrupole: -92.3260 -102.2630 -110.0814
quadrupole: -0.3526 0.7054 1.1993
quadrupole: 9.2308 -0.7062 -8.5246 -0.3526 0.7054 1.1993
hfenergy: -762.285428 hartree
pointgroup: C01 [X(C14H18N4)]
dipole: -2.1874533 -0.1259651 -0.1977773 debye
polarizability: 304.9640603|6.7352088|182.4316089|10.1201857|-6.7533902|101.5286811 unknown
InChI: InChI=1S/C14H18N4/c1-4-17-10(3)18(5-2)14-13(17)15-11-8-6-7-9-12(11)16-14/h6-10H,4-5H2,1-3H3
charge 0 multiplicity 1
36 atoms
N  -1.702789 1.047418 -0.439351
N  -1.627404 -1.221817 0.002766
N  0.694724 1.477583 -0.332683
N  0.796983 -1.42389 0.199167
C  -2.59597 -0.135412 -0.308968
C  -0.376466 0.693358 -0.261827
C  -0.326057 -0.742133 0.003965
C  -2.155597 2.385198 -0.838267
C  -1.988669 -2.637297 0.128486
C  -3.681912 0.031745 0.774269
C  -2.246562 3.37924 0.341164
C  -2.398845 -3.289944 -1.211418
C  1.917337 0.795692 -0.124168
C  1.967741 -0.631348 0.139368
C  3.130598 1.534033 -0.174531
C  3.229178 -1.254768 0.33871
C  4.366205 0.895739 0.026805
C  4.415623 -0.503611 0.284094
H  -3.096907 -0.332649 -1.287564
H  -1.434975 2.77381 -1.582759
H  -3.136366 2.283793 -1.341345
H  -1.093696 -3.141839 0.533341
H  -2.800656 -2.749355 0.873338
H  -3.218119 0.20351 1.76007
H  -4.336065 0.887341 0.528998
H  -4.317205 -0.870831 0.826517
H  -2.971064 3.038851 1.101865
H  -1.25788 3.483815 0.819072
H  -2.563278 4.374303 -0.022317
H  -1.578591 -3.213661 -1.945878
H  -2.625438 -4.360378 -1.05584
H  -3.299573 -2.815407 -1.643171
H  3.065709 2.608562 -0.374891
H  3.240548 -2.33198 0.534722
H  5.294508 1.476391 -0.014665
H  5.381831 -0.996362 0.440023
