program: Gaussian 09
title: 000170502
version: EM64L-G09RevD.01
frameworkgroup: C1[X(C11H10N2O3)]
method: RPBEPBE
basis: SDD
operation: Freq
keyword: #p
keyword: freq=noraman
keyword: PBEPBE/SDD
title: #p freq=noraman PBEPBE/SDD
converged: YES YES NO NO
title: Mulliken charges:
elementType: O O O N N C C C C C C C C C C C H H H H H H H H H H
charge: -0.246496 -0.411393 -0.255346 -0.280603 -0.127450 0.315574 0.453464 0.178559 -0.444524 -0.665015 -0.358889 -0.379001 0.149015 -0.211449 -0.210053 -0.246329 0.301326 0.240239 0.266521 0.293384 0.284192 0.264804 0.232269 0.231404 0.233081 0.392716
chargesum: 0.00000
title: Mulliken charges with hydrogens summed into heavy atoms:
elementType: O O O N N C C C C C C C C C C C
charge: -0.246496 -0.018677 -0.255346 -0.280603 -0.127450 0.315574 0.453464 0.178559 -0.143197 0.135129 -0.074697 -0.114198 0.149015 0.020820 0.021351 -0.013248
polarizability: 2.29425708e+02 -4.26994780e+00 1.51851740e+02 4.16244432e+00 7.20244708e+00 7.58381967e+01
1716.lowfreq: -11.9541 -5.5286 -0.0008 -0.0007 -0.0007 6.1438 42.8235 56.0270 76.8434
frequency: 42.7539 56.0044 76.8323 88.8615 143.7745 156.1698 174.4744 192.8123 251.5884 272.4147 285.4015 319.2807 392.4035 406.7254 412.1128 462.2718 496.3856 532.3799 593.8130 607.3920 613.8727 618.4400 647.7700 680.4792 695.1360 705.2058 733.6075 761.3729 818.7322 831.8710 840.8747 914.4402 965.1765 971.9603 985.7439 990.2867 993.6970 1030.3938 1050.6442 1089.6473 1092.8635 1128.9022 1140.1375 1173.9753 1186.4869 1194.6468 1207.4898 1293.6946 1318.8161 1333.3023 1382.1270 1401.6338 1438.6106 1447.3909 1478.8857 1482.9970 1493.2861 1534.3136 1589.8598 1607.0403 1639.3346 1650.1049 2984.9736 3097.8764 3131.4705 3141.3531 3142.4682 3153.5143 3167.6090 3191.4573 3263.2143 3529.7090
redmass: 5.1460 6.9757 5.1541 5.9626 3.6718 2.4286 1.5599 5.1357 5.2792 5.3355 4.6281 4.3743 6.3164 3.6290 5.7897 6.2353 3.4557 2.5860 2.2281 3.4608 4.7937 4.6628 4.9238 3.9298 2.1785 5.1883 6.0124 1.6839 4.3300 1.6032 1.2547 1.4049 4.0605 1.5201 5.6612 3.0809 1.7311 1.9962 2.4192 1.6149 2.2396 1.5288 1.5119 1.0523 1.1246 5.0149 2.4454 2.5415 1.5677 2.8271 8.0937 2.7212 1.6560 1.8851 1.0661 2.3647 1.1593 8.4888 6.4362 6.0662 9.7818 9.2500 1.0420 1.0918 1.0853 1.0909 1.1005 1.0946 1.0996 1.0963 1.0988 1.0643
irintensity: 1.6273 1.5033 1.1283 0.5453 2.0848 3.8302 1.1282 3.4314 2.0725 2.1431 19.4307 5.7877 2.5709 1.1219 0.3974 17.9790 20.4309 40.6253 47.1069 46.3254 21.4193 38.2230 18.4436 0.6056 27.8901 10.5112 45.2972 75.9679 4.0546 40.2917 1.3093 3.6951 33.8015 5.0175 12.0792 41.2148 14.7699 52.0281 216.6536 24.8220 49.7744 147.7915 30.8041 0.1698 0.8236 12.8675 2.6562 110.5811 11.7285 9.9469 9.6682 29.8610 22.6494 52.6316 58.6517 77.1324 1.6854 85.7391 3.3333 29.6254 615.7184 19.6768 48.4970 13.9546 1.8732 8.7452 0.4452 23.3017 22.1387 1.6784 5.2611 76.2002
temp: 298.150 k
press: 1.00000 atm
elementType: 8 8 8 7 7 6 6 6 6 6 6 6 6 6 6 6 1 1 1 1 1 1 1 1 1 1
symmnumber: 1
zpe: 507950.8 jmol-1
zpe.correction: 0.193468 hartree
zpe.thermalcorrener: 0.207417 hartree
zpe.thermalcorrenthalpy: 0.208361 hartree
zpe.thermalcorrgfe: 0.152138 hartree
zpe.sumelectzpe: -759.183037 hartree
zpe.sumelectthermal: -759.169088 hartree
zpe.sumelectthermalent: -759.168144 hartree
zpe.sumelectthermalfe: -759.224367 hartree
dipole: -0.6228 -3.5090 1.0720
dipole: 3.7215
quadrupole: -71.9643 -103.4958 -91.6802
quadrupole: -7.0481 1.3706 2.7315
quadrupole: 17.0825 -14.4490 -2.6334 -7.0481 1.3706 2.7315
hfenergy: -759.3765052 hartree
pointgroup: C01 [X(C11H10N2O3)]
dipole: -0.2198276 1.3505875 -0.5209418 debye
dipolederiv: -0.491076 0.5251266 -0.1209935 0.1059113 -1.1047494 0.1500968 -0.0294273 0.1397143 -0.3579745 -1.289032 -0.369171 0.1175506 -0.5882849 -0.4823957 0.0706903 0.1563984 0.0604613 -0.4350474 -0.8467089 0.1872058 0.0256189 0.3116088 -0.9518478 0.1063901 0.0272382 0.0806333 -0.3446376 -0.8441577 -0.4416595 0.1273711 -0.0257225 -0.3898032 0.0313835 0.3632257 0.2583914 -0.2254942 0.0988246 -0.4047109 0.0907602 -0.4071749 -0.9085921 0.2207232 -0.2132162 -0.1950264 -0.0700379 -0.7819691 0.4641684 -0.0986046 0.8354587 0.3795827 -0.1028927 -0.1452967 0.0148845 0.0080617 0.9741717 0.3242855 0.0262641 0.1745513 0.053637 0.0887887 -0.0728207 -0.0237681 0.1056496 0.5508808 -0.6883044 0.1091523 -0.1262124 1.4270766 -0.2220704 0.046497 -0.1799439 0.2087043 -0.0551804 0.4519821 -0.1276171 -0.282412 -0.3180532 0.064871 -0.0706757 -0.0304926 -0.1886476 0.0035085 0.1187922 -0.0499326 0.1531772 0.3969902 -0.190027 0.0491403 -0.0221568 0.3507155 -0.2292423 -0.0085007 0.0073277 0.0769677 0.0343084 0.0649795 -0.0368743 0.0006376 -0.1149607 -0.1136857 -0.0551848 -0.0164169 -0.0771841 -0.1331531 0.0375675 -0.0290198 0.0544473 -0.1217678 2.3220417 -0.1049062 -0.127203 -0.1905977 1.3370006 -0.184718 -0.1441338 -0.1936464 0.3105714 0.1135415 -0.0723856 -0.047837 -0.0842633 0.040564 0.0918083 -0.0639541 0.0728285 -0.0958619 -0.0670142 0.0218868 0.0032379 0.0813045 0.0824125 0.1154693 0.0565172 0.119744 -0.0874951 0.025009 0.0288608 0.0129326 -0.0189026 -0.1056162 0.0291149 -0.0282952 0.0218046 -0.1519017 0.0842364 -0.0153777 0.0183377 -0.007043 0.1123309 0.02634 0.085059 0.0131311 0.1858526 0.0806214 -0.0195113 0.0095142 -0.0368015 -0.0151581 -0.082972 0.0079606 0.0848 -0.1571183 -0.0180074 -0.148208 0.0269488 -0.0959988 0.0813533 -0.0026655 -0.0186562 -0.0279922 0.068278 0.0950909 0.1108276 -0.0328276 0.0391721 0.0916072 0.0048112 -0.0002972 -0.0117579 0.1004653 0.1169985 -0.0488205 -0.0196142 -0.0289622 0.0436518 -0.0646442 -0.0267249 -0.0321662 0.1259355 0.0101166 0.0838 0.0459167 0.0684748 0.0674481 -0.0527244 0.0722455 -0.0342741 0.1193251 -0.0324648 0.07254 0.0509388 0.0933596 0.0247217 -0.072245 0.0649267 -0.0622252 0.117327 0.0534276 -0.0417125 -0.0166535 -0.0719324 -0.0482745 -0.1053294 -0.0282343 -0.1012438 0.1018767 -0.1203644 -0.0521102 -0.0114981 -0.0575699 0.0917526 -0.0349582 -0.0092553 -0.0256545 0.150424 0.3604336 0.0810875 -0.0026735 0.1590763 0.1932057 0.0122125 -0.012327 0.0188703 0.3977581 unknown
polarizability: 229.5376597|2.480091|152.3715873|-4.6251491|1.6852082|75.2063972 unknown
InChI: InChI=1S/C11H10N2O3/c1-12-9(11(15)16)7-10(14)13(12)8-5-3-2-4-6-8/h2-7,15H,1H3
charge 0 multiplicity 1
26 atoms
O  0.244002 -2.746231 0.358659
O  -4.454968 -0.279773 0.308973
O  -3.598288 1.843802 -0.091403
N  0.117435 -0.39456 -0.144142
N  -0.90852 0.591644 -0.194617
C  -2.110289 -0.093689 0.059628
C  1.492282 -0.022081 -0.045716
C  -0.441685 -1.697407 0.197488
C  -1.870355 -1.433739 0.327996
C  -0.786417 1.658047 -1.220633
C  2.477451 -0.908441 -0.550283
C  1.872146 1.192696 0.583556
C  -3.405551 0.612186 0.070922
C  3.840467 -0.564235 -0.431403
C  3.238271 1.530155 0.677014
C  4.228167 0.655969 0.169819
H  -2.608329 -2.170989 0.629009
H  -0.831866 1.231223 -2.241057
H  0.169071 2.187097 -1.093814
H  -1.618752 2.359521 -1.06802
H  2.171167 -1.853235 -1.004425
H  1.107042 1.840362 1.024931
H  4.601111 -1.252318 -0.815598
H  3.5293 2.467653 1.163336
H  5.288304 0.918417 0.250958
H  -5.309795 0.228724 0.335126
