program: Gaussian 09
title: 000170488
version: EM64L-G09RevD.01
frameworkgroup: C1[X(C9H17ClO2)]
method: RPBEPBE
basis: SDD
operation: Freq
keyword: #p
keyword: freq=noraman
keyword: PBEPBE/SDD
title: #p freq=noraman PBEPBE/SDD
converged: YES YES NO NO
title: Mulliken charges:
elementType: Cl O O C C C C C C C C C H H H H H H H H H H H H H H H H H
charge: -0.085793 -0.249254 -0.282132 -0.425489 -0.405695 -0.000600 -0.384877 -0.308676 -0.228144 -0.369340 -0.338602 -0.586037 0.202385 0.216503 0.214324 0.223548 0.206337 0.200706 0.206277 0.203433 0.214467 0.212869 0.179074 0.202474 0.228608 0.227407 0.202343 0.257435 0.266448
chargesum: 0.00000
title: Mulliken charges with hydrogens summed into heavy atoms:
elementType: Cl O O C C C C C C C C C
charge: -0.085793 -0.249254 -0.282132 -0.006602 0.032177 0.205737 0.022107 0.109225 0.163799 0.061742 0.091148 -0.062153
polarizability: 1.24801487e+02 -1.91081210e+00 1.12537546e+02 1.49442621e+00 1.11013510e+00 9.19245099e+01
1716.lowfreq: -7.0149 -2.5404 0.0009 0.0013 0.0024 14.5430 22.8764 34.1578 66.8861
frequency: 18.6876 32.0058 66.8846 74.5714 97.8923 137.6279 148.4883 196.6580 224.5513 259.8600 301.8534 337.6053 398.9089 423.6165 448.7694 505.8428 542.8503 596.2873 666.6974 761.7239 768.9081 794.3632 833.4335 847.5197 864.5529 879.7393 883.9240 937.1753 972.0995 1005.4228 1009.8412 1028.2890 1051.4760 1053.5162 1083.4112 1103.3118 1110.6985 1120.5247 1157.6046 1171.3442 1182.9482 1189.3480 1251.2055 1254.3080 1270.6136 1273.9281 1278.6929 1302.5092 1309.5816 1327.9125 1342.5607 1348.7877 1352.6849 1363.4215 1366.3498 1389.3359 1444.6330 1449.4608 1450.6058 1455.2346 1456.4448 1473.3094 1475.7847 1494.1669 2927.5725 2958.6176 2978.8309 2982.5136 2985.1520 2994.5459 2996.4315 3006.3283 3006.9325 3026.7509 3042.3507 3050.6393 3056.9227 3070.2894 3071.0947 3081.6334 3131.6412
redmass: 5.0218 4.3999 3.6891 3.0224 2.2285 3.5762 3.0023 3.2007 2.5286 2.3498 3.2762 2.0578 3.1056 3.6149 3.1806 2.1940 3.6587 4.2764 3.1909 1.1704 3.9118 1.8634 1.4667 2.6726 2.0424 2.5111 1.4982 1.6440 4.7391 2.5866 2.2907 2.8547 1.4662 2.0083 2.6114 2.0481 2.1123 2.0934 1.2915 1.2723 1.4894 1.3418 1.2560 1.2338 1.2223 1.1143 1.2421 1.1575 1.2961 1.2074 1.4073 1.4638 1.4207 1.3462 1.4104 1.5139 1.0912 1.0942 1.0852 1.0864 1.0896 1.0909 1.0839 1.0858 1.0626 1.0641 1.0660 1.0600 1.0801 1.0694 1.0609 1.0804 1.0781 1.0908 1.1003 1.0598 1.1011 1.1025 1.1026 1.1010 1.1112
irintensity: 0.6392 2.2087 2.5197 0.1860 0.9793 0.8305 3.7182 10.5674 1.2902 2.5989 6.5411 8.4186 6.1034 1.3938 0.6680 1.7683 5.5686 20.6720 0.4537 15.1654 22.0937 18.0319 4.6883 15.9850 30.5886 33.6762 19.7858 30.8160 144.2112 53.0810 1.4364 63.8913 8.6152 31.9268 8.1859 1.5713 32.4153 17.1395 1.3693 4.8120 23.8412 2.3293 3.1673 6.4548 7.8121 6.0243 1.5869 22.7062 31.6466 10.4917 1.2171 6.9599 0.9394 0.1885 1.3236 2.4221 7.7661 10.6020 3.8699 5.5926 12.8417 12.3116 2.7288 8.2901 55.2532 29.9160 41.7659 39.9665 29.0495 7.8097 43.1489 69.9273 22.9377 10.5387 31.1375 28.8404 47.3540 47.2492 46.2860 47.1105 19.9467
temp: 298.150 k
press: 1.00000 atm
elementType: 17 8 8 6 6 6 6 6 6 6 6 6 1 1 1 1 1 1 1 1 1 1 1 1 1 1 1 1 1
symmnumber: 1
zpe: 656693.7 jmol-1
zpe.correction: 0.250121 hartree
zpe.thermalcorrener: 0.263474 hartree
zpe.thermalcorrenthalpy: 0.264418 hartree
zpe.thermalcorrgfe: 0.207456 hartree
zpe.sumelectzpe: -962.660942 hartree
zpe.sumelectthermal: -962.647589 hartree
zpe.sumelectthermalent: -962.646645 hartree
zpe.sumelectthermalfe: -962.703607 hartree
dipole: -0.4881 -1.9432 -0.2416
dipole: 2.0180
quadrupole: -79.5050 -77.3631 -83.5848
quadrupole: -12.5427 3.9807 1.6696
quadrupole: 0.6460 2.7879 -3.4339 -12.5427 3.9807 1.6696
hfenergy: -962.9110631 hartree
pointgroup: C01 [X(C9H17Cl1O2)]
dipole: -0.1360316 -0.7742936 -0.1110554 debye
polarizability: 124.9931864|-1.0515127|112.2720968|1.5959357|1.6053383|91.9982594 unknown
InChI: InChI=1S/C9H17ClO2/c10-6-2-4-8-12-9-5-1-3-7-11-9/h9H,1-8H2
charge 0 multiplicity 1
29 atoms
Cl 4.545126 1.816128 -0.083074
O  -1.980308 -0.321484 1.357378
O  -0.401844 -0.612573 -0.458727
C  -2.748408 -0.813477 -0.966503
C  -3.000133 0.693805 -1.205648
C  -1.678584 -1.036105 0.113178
C  -3.322362 1.396546 0.135063
C  -2.195991 1.132729 1.149151
C  0.757386 -0.931326 0.395493
C  1.998688 -0.341864 -0.280058
C  3.284529 -0.652405 0.516219
C  4.558255 -0.084119 -0.107715
H  -3.681461 -1.299706 -0.622541
H  -2.423314 -1.316188 -1.894904
H  -3.828199 0.829934 -1.925607
H  -2.094102 1.146018 -1.651747
H  -1.619873 -2.094272 0.440376
H  -3.435899 2.488553 -0.00975
H  -4.277983 1.011606 0.542232
H  -1.249612 1.594241 0.800299
H  -2.43982 1.516988 2.153176
H  0.607357 -0.501041 1.406403
H  0.844125 -2.036746 0.499223
H  2.079236 -0.750244 -1.306343
H  1.874596 0.752284 -0.375364
H  3.191831 -0.284002 1.556341
H  3.423662 -1.753874 0.58248
H  4.666631 -0.351467 -1.17057
H  5.462969 -0.360038 0.454639
