program: Gaussian 09
title: 000170481
version: EM64L-G09RevD.01
frameworkgroup: C1[X(C7H6INO2)]
method: RPBEPBE
basis: SDD
operation: Freq
keyword: #p
keyword: freq=noraman
keyword: PBEPBE/SDD
title: #p freq=noraman PBEPBE/SDD
converged: YES YES NO YES
title: Mulliken charges:
elementType: I O O N C C C C C C C H H H H H H
charge: 0.138161 -0.203208 -0.197441 0.022086 0.383344 0.219902 -0.361419 -0.270001 -0.763349 -0.160453 -0.349380 0.248572 0.306403 0.256695 0.214070 0.256670 0.259348
chargesum: 0.00000
title: Mulliken charges with hydrogens summed into heavy atoms:
elementType: I O O N C C C C C C C
charge: 0.138161 -0.203208 -0.197441 0.022086 0.383344 0.219902 -0.112847 0.036402 -0.035913 0.098895 -0.349380
polarizability: 1.83564139e+02 7.74535063e+00 1.18643498e+02 1.84252980e-02 6.90196102e-03 4.23303384e+01
1716.lowfreq: -9.8541 -7.3893 0.0000 0.0003 0.0004 1.8627 11.5977 89.2294 123.8710
frequency: 10.9839 89.2239 123.8678 145.9012 224.3529 226.2732 281.4017 287.5626 366.7551 379.1521 426.1785 513.1818 517.2350 601.4762 664.9706 666.2559 721.3421 756.3172 824.8263 826.1412 927.1693 970.2482 999.4909 1040.1362 1055.7807 1079.2812 1161.9146 1196.4817 1211.0796 1265.4256 1338.0224 1367.5143 1396.9992 1405.3330 1453.8645 1461.5435 1466.0968 1556.3474 1595.7803 2997.4783 3083.0303 3099.5060 3143.1706 3173.5124 3187.1622
redmass: 10.6432 4.0224 12.9580 5.3141 1.0647 9.2972 5.7365 3.9156 4.6272 6.7769 3.3500 4.0429 4.8138 6.9506 4.4651 8.5791 5.3582 6.9052 7.2487 1.2891 1.4004 1.3569 1.4918 1.5549 4.0207 2.5447 1.3995 6.3951 3.3261 1.3618 3.4050 7.3960 5.1152 1.2468 1.0455 2.6740 1.1417 6.9769 7.2039 1.0365 1.0960 1.1015 1.0896 1.0964 1.0924
irintensity: 0.0664 0.3137 1.0904 0.4422 0.9005 1.4427 2.7066 0.0077 0.2217 0.2768 1.7314 25.5656 0.2217 16.9376 0.1390 15.8013 7.7879 18.8023 23.4461 28.6046 15.1839 0.2462 4.4783 10.8768 50.0616 14.3041 4.1908 228.6772 42.3171 9.3498 11.3878 108.7866 30.9146 12.3261 13.4719 110.2962 13.7690 7.4584 5.0625 11.7968 6.1902 25.1426 7.4325 4.5273 8.4501
temp: 298.150 k
press: 1.00000 atm
elementType: 53 8 8 7 6 6 6 6 6 6 6 1 1 1 1 1 1
symmnumber: 1
zpe: 306757.0 jmol-1
zpe.correction: 0.116838 hartree
zpe.thermalcorrener: 0.127085 hartree
zpe.thermalcorrenthalpy: 0.128029 hartree
zpe.thermalcorrgfe: 0.077618 hartree
zpe.sumelectzpe: -486.170810 hartree
zpe.sumelectthermal: -486.160563 hartree
zpe.sumelectthermalent: -486.159619 hartree
zpe.sumelectthermalfe: -486.210030 hartree
dipole: -1.2971 4.3679 0.0007
dipole: 4.5564
quadrupole: -84.1016 -77.3647 -79.5587
quadrupole: 12.3795 0.0034 0.0024
quadrupole: -3.7600 2.9769 0.7830 12.3795 0.0034 0.0024
hfenergy: -486.2876474 hartree
pointgroup: C01 [X(C7H6I1N1O2)]
dipole: 0.9393285 1.5268362 -0.0002646 debye
dipolederiv: -0.4017229 0.1985804 -0.0000711 0.2358104 -0.1027315 0.0000283 -0.0000651 0.0000116 0.0247589 -0.5137379 -0.0708961 0.0000449 -0.1224706 -0.8750499 -0.0001792 0.0000655 0.0000214 -0.228116 -0.8951302 0.1152929 0.0000292 0.0399954 -0.4851625 -0.0000132 0.00015 -0.0001225 -0.2095681 1.5010039 0.2277242 -0.0001442 0.3827861 1.2938168 0.0002306 -0.0001008 0.0001475 0.1851323 0.2944066 -0.3087046 0.0001063 0.1129022 0.1429461 -0.0000123 0.000045 -0.0000478 0.0264001 -0.4399541 -0.2806188 0.0000554 -0.348177 -0.1542824 -0.0000376 -0.0001552 0.0000028 0.0313014 -0.2498404 0.1148674 -0.0000453 0.0677706 0.1011413 -0.0000336 -0.0000751 0.0000296 -0.1543888 -0.2392886 0.3447965 -0.0000731 0.1190373 -0.1590182 0.0000297 -0.0001183 0.0000362 -0.0389182 -0.1717862 0.2578411 -0.0000517 0.0618493 0.1072768 -0.0000469 0.0002627 -0.0002065 0.0194916 -0.2033451 0.2366914 -0.0000356 0.1649064 0.0603349 0.0000273 -0.0000894 0.0000159 -0.0500814 0.9600157 -0.6800151 0.000206 -0.6940514 0.0500559 -0.0001004 0.0001945 -0.0000665 -0.1841305 0.0500871 0.0437738 -0.0000132 0.0069639 -0.0914756 0.0000356 0.0000224 0.0000321 0.1536451 0.1656337 -0.0137018 0.0000022 0.0403409 0.0722022 0.0000403 0.000097 -0.0000307 0.1689278 0.0382711 0.0047774 0.0718495 -0.0074526 0.057661 0.0523032 0.0816564 0.0219745 -0.0041174 0.0720801 -0.1280156 0.0000246 0.0071299 -0.1553036 0.0000875 -0.0000386 0.0001018 0.1071264 0.0381912 0.0047584 -0.0718613 -0.0075421 0.0576073 -0.0523493 -0.0818857 -0.0218752 -0.0041128 -0.0048841 -0.0671514 -0.0000225 -0.0597989 0.0799812 -0.00001 0.0000346 -0.0000241 0.1566497 unknown
polarizability: 175.2937745|-22.9893209|126.9138623|0.0159989|-0.0114526|42.3303384 unknown
InChI: InChI=1S/C7H6INO2/c1-5-2-3-6(8)4-7(5)9(10)11/h2-4H,1H3
charge 0 multiplicity 1
17 atoms
I  3.79116 -1.338434 0.000616
O  -1.607485 -2.323326 -0.000249
O  -2.878974 -0.440141 0.000148
N  -1.734106 -1.037592 -0.000275
C  -0.533627 1.214426 -0.000406
C  -0.49237 -0.212108 -0.000204
C  0.730528 1.863467 -0.000305
C  0.720682 -0.945586 0.000076
C  -1.785339 2.067759 -0.000736
C  1.953783 1.162648 -0.000007
C  1.939665 -0.250848 0.00018
H  0.752634 2.95847 -0.000469
H  0.668278 -2.036495 0.000196
H  -2.42049 1.860411 0.87747
H  -1.510802 3.135877 -0.001073
H  -2.420452 1.859847 -0.878835
H  2.898916 1.712324 0.000074
