program: Gaussian 09
title: 000170479
version: EM64L-G09RevD.01
frameworkgroup: C1[X(C7H16N4)]
method: RPBEPBE
basis: SDD
operation: Freq
keyword: #pfreq=noraman
keyword: PBEPBE/SDD
title: #p freq=noraman PBEPBE/SDD
converged: YES YES NO NO
title: Mulliken charges:
elementType: N N N N C C C C C C C H H H H H H H H H H H H H H H H
charge: -0.287527 -0.325717 -0.554185 -0.017198 -0.375522 -0.377655 -0.341344 -0.060213 -0.407904 -0.709233 -0.143365 0.190883 0.211275 0.221333 0.211524 0.243895 0.199423 0.173322 0.261181 0.229079 0.197304 0.228531 0.235923 0.216122 0.246840 0.267201 0.266028
chargesum: 0.00000
title: Mulliken charges with hydrogens summed into heavy atoms:
elementType: N N N N C C C C C C C
charge: -0.043632 -0.064536 -0.020956 -0.017198 0.026636 0.055202 0.031400 0.168866 0.017931 -0.010348 -0.143365
polarizability: 1.26645893e+02 2.64663918e+00 1.00358366e+02 1.12180866e+00 -2.11972135e+00 7.93536132e+01
1716.lowfreq: -4.8858 -0.0008 -0.0007 0.0001 3.7413 7.1530 29.4865 44.4234 57.2920
frequency: 29.3929 44.2851 57.2268 70.5171 105.8875 128.8758 138.5719 165.3375 188.5971 214.2907 246.7391 264.9289 266.0625 289.1598 394.1789 440.4177 482.2430 549.3436 560.3241 574.6378 625.4844 682.6011 777.9311 784.4664 815.2687 937.8649 960.7201 1008.3940 1010.1669 1034.9792 1070.4041 1080.0837 1096.6129 1103.3124 1124.0003 1148.1451 1156.6243 1191.6714 1219.8597 1266.8688 1276.5039 1277.6336 1294.3105 1320.4100 1324.4667 1332.8057 1361.7308 1388.4172 1393.5593 1445.9449 1459.5768 1463.9809 1475.6817 1478.1058 1482.2568 1490.2849 1497.7909 1643.0432 2192.6909 2841.9421 2846.8114 2890.5891 2909.1582 2976.4179 2978.6097 2993.6339 2995.8074 3011.2693 3057.2414 3094.3329 3116.9157 3423.0033 3452.7191 3468.3199 3595.6960
redmass: 4.6936 2.1030 3.2952 4.1066 1.7438 3.7188 2.9321 2.4337 3.2550 1.3813 4.5417 1.4646 1.4198 3.3680 2.8892 3.8230 2.6013 3.4176 1.5745 2.3673 2.6707 1.3037 1.1051 2.8046 1.1401 1.7215 1.2075 3.2712 3.5480 2.3443 2.3487 1.7565 2.0462 3.5215 1.6855 3.3501 3.5002 1.7533 1.4166 1.2052 1.1828 1.1677 1.2530 1.2159 1.3143 1.2913 1.3452 1.2044 1.4411 1.2239 1.1650 1.0816 1.0735 1.0722 1.0963 1.0781 1.0857 1.0906 12.5475 1.0707 1.0797 1.0684 1.0666 1.0705 1.0883 1.0815 1.0363 1.0951 1.1009 1.0987 1.1015 1.0738 1.0746 1.0445 1.0982
irintensity: 2.7023 3.2995 0.7192 3.3575 2.6324 0.8935 2.5954 4.3996 4.6142 0.1651 0.5641 25.9261 34.6866 2.8727 12.9319 9.7082 48.2627 17.3629 291.6229 88.0787 17.5300 103.8681 2.1388 3.3228 3.8296 0.8852 2.7578 15.0399 4.8094 9.7487 10.8488 4.0582 3.0883 10.4269 10.8864 11.1976 145.3569 4.0818 11.0905 0.4705 0.8600 7.5650 0.0759 4.1470 31.9218 0.7266 1.8271 18.2046 0.7357 6.2099 27.1526 16.0042 7.4568 10.9795 1.0615 3.7823 5.4503 33.8416 1.7847 130.1047 60.3003 29.1988 139.9060 20.5458 10.7032 64.5377 22.1545 57.5165 46.8410 24.3762 17.9843 1.4298 0.8336 1.0477 0.5860
temp: 298.150 k
press: 1.00000 atm
elementType: 7 7 7 7 6 6 6 6 6 6 6 1 1 1 1 1 1 1 1 1 1 1 1 1 1 1 1
symmnumber: 1
zpe: 613433.9 jmol-1
zpe.correction: 0.233645 hartree
zpe.thermalcorrener: 0.247897 hartree
zpe.thermalcorrenthalpy: 0.248842 hartree
zpe.thermalcorrgfe: 0.191151 hartree
zpe.sumelectzpe: -494.389612 hartree
zpe.sumelectthermal: -494.375359 hartree
zpe.sumelectthermalent: -494.374415 hartree
zpe.sumelectthermalfe: -494.432106 hartree
dipole: -0.3679 -4.5291 0.1301
dipole: 4.5458
quadrupole: -76.9973 -71.4163 -69.8990
quadrupole: -9.9211 12.4924 0.2252
quadrupole: -4.2265 1.3545 2.8719 -9.9211 12.4924 0.2252
hfenergy: -494.6232567 hartree
pointgroup: C01 [X(C7H16N4)]
dipole: 0.171043 1.7774764 0.0997216 debye
polarizability: 126.7031279|2.3114449|100.1522318|-1.3049566|2.7018025|79.5025126 unknown
InChI: InChI=1S/C7H16N4/c1-7(6-9)11-5-4-10-3-2-8/h7,10-11H,2-5,8H2,1H3
charge 0 multiplicity 1
27 atoms
N  1.910733 -0.125054 0.191468
N  -1.7292 0.834499 -0.149789
N  5.725649 -0.072705 -0.163208
N  -3.619808 -2.075324 -0.410071
C  0.727494 0.568892 -0.356136
C  -0.545848 0.129055 0.390279
C  3.209685 0.311786 -0.360483
C  -3.038083 0.415916 0.395221
C  4.385075 -0.433661 0.327079
C  -4.146806 1.395673 -0.060545
C  -3.356025 -0.965738 -0.060658
H  0.881256 1.659059 -0.213142
H  0.571866 0.406083 -1.449824
H  -0.701554 -0.957629 0.237056
H  -0.394349 0.28754 1.484111
H  1.805092 -1.148326 0.132701
H  3.317127 1.400057 -0.174695
H  3.291373 0.166625 -1.469592
H  -1.630699 1.85768 -0.11191
H  -3.042672 0.375688 1.514939
H  4.250554 -1.526487 0.194181
H  4.335721 -0.243012 1.414461
H  -5.135091 1.070894 0.304255
H  -3.942493 2.403712 0.344959
H  -4.171893 1.452426 -1.161312
H  6.022678 0.880029 0.064728
H  5.902818 -0.309779 -1.143375
