program: Gaussian 09
title: 000170474
version: EM64L-G09RevD.01
frameworkgroup: C1[X(C12H15NO)]
method: RPBEPBE
basis: SDD
operation: Freq
keyword: #p
keyword: freq=noraman
keyword: PBEPBE/SDD
title: #p freq=noraman PBEPBE/SDD
converged: YES YES NO NO
title: Mulliken charges:
elementType: O N C C C C C C C C C C C C H H H H H H H H H H H H H H H
charge: -0.429818 -0.168935 0.083809 -0.378790 -0.374559 0.183293 -0.423579 0.375032 -0.419778 -0.540475 -0.543333 0.095321 -0.416337 -0.415240 0.208041 0.204543 0.202211 0.208068 0.224327 0.203938 0.201496 0.220604 0.206404 0.231720 0.212468 0.224760 0.228153 0.245420 0.351237
chargesum: 0.00000
title: Mulliken charges with hydrogens summed into heavy atoms:
elementType: O N C C C C C C C C C C C C
charge: -0.078581 -0.168935 0.083809 0.033794 0.035719 0.183293 0.004685 0.375032 0.002322 -0.102351 -0.106105 0.095321 -0.188184 -0.169820
polarizability: 1.67887423e+02 -3.86877942e+00 1.58286276e+02 1.89604593e+00 -1.50110541e+00 8.09816066e+01
1716.lowfreq: -0.0006 -0.0005 0.0005 9.7828 17.4373 18.9092 79.7141 95.6658 124.3511
frequency: 79.7068 95.6294 124.3441 134.8535 246.4334 269.5977 288.4977 296.1723 309.7172 344.7756 374.8826 402.9012 438.7134 477.3541 485.4911 514.0629 534.0937 584.5061 598.9299 609.6677 714.6561 737.3701 793.7198 822.3906 851.6477 868.3962 891.1664 892.9860 930.5329 934.3550 945.8185 1019.2978 1055.9075 1060.5910 1074.3890 1081.1682 1113.7592 1139.3094 1152.1984 1157.4252 1185.9936 1203.4664 1206.2091 1222.0395 1245.3006 1264.3410 1281.5346 1289.2392 1319.8883 1331.3171 1331.3988 1347.7118 1349.9498 1355.3463 1388.9400 1396.6834 1445.7176 1457.6325 1462.5242 1463.9686 1470.4430 1475.9078 1479.0895 1513.9581 1607.9140 1615.5798 2887.8979 2894.5871 2929.6231 2953.5597 2970.8238 2994.8946 3003.0997 3011.2944 3023.8013 3026.9373 3062.4954 3066.7433 3117.7326 3175.9022 3578.9822
redmass: 2.6887 2.4448 3.5373 2.8217 1.7386 2.1786 3.7163 2.2460 1.8936 2.5361 4.2439 4.3405 4.2623 4.5024 3.3947 3.8579 2.6219 2.7956 3.0266 4.0677 4.6226 4.5354 1.4417 2.5800 1.8782 1.5533 1.6365 2.7519 2.2876 1.4698 2.5034 2.6223 2.1940 1.9192 1.7821 1.6937 2.0584 1.5083 1.6520 1.4057 1.2965 1.4533 1.5346 2.0992 1.4956 1.5771 1.3518 1.8093 2.0054 1.6087 1.6075 1.4613 1.4160 1.4808 2.5241 2.9621 1.6099 1.1604 1.1227 1.0971 1.8886 1.2952 1.2949 1.5456 7.4666 6.7071 1.0697 1.0717 1.0586 1.0662 1.0991 1.0669 1.0654 1.0862 1.0860 1.0910 1.1041 1.1042 1.0897 1.0948 1.0651
irintensity: 0.7292 0.5335 3.9819 1.2731 63.6533 11.4879 7.7533 49.7276 13.3947 0.1467 0.5241 2.2013 3.1673 0.6586 9.1053 0.4059 3.0252 18.5027 0.0713 6.7253 2.1034 2.4372 43.3539 8.4896 0.8190 4.8138 6.2136 0.2244 11.2856 2.7343 2.4407 0.1844 5.6213 1.2631 3.3332 3.1225 17.0481 226.1202 43.1970 24.4174 22.2103 1.6375 7.3384 50.1820 7.5137 3.3790 3.7857 3.7594 84.2751 6.5416 42.9184 19.7378 0.7132 2.5194 7.5341 3.6417 24.2027 10.5671 22.2633 6.1520 31.2743 43.2912 36.4432 65.3819 67.1654 95.3269 32.9286 181.1098 53.6611 48.5141 24.2248 13.7516 30.6042 55.1919 76.5198 57.0609 51.4095 47.8358 20.1205 7.4919 19.3405
temp: 298.150 k
press: 1.00000 atm
elementType: 8 7 6 6 6 6 6 6 6 6 6 6 6 6 1 1 1 1 1 1 1 1 1 1 1 1 1 1 1
symmnumber: 1
zpe: 645133.4 jmol-1
zpe.correction: 0.245718 hartree
zpe.thermalcorrener: 0.257510 hartree
zpe.thermalcorrenthalpy: 0.258454 hartree
zpe.thermalcorrgfe: 0.208519 hartree
zpe.sumelectzpe: -595.219537 hartree
zpe.sumelectthermal: -595.207745 hartree
zpe.sumelectthermalent: -595.206801 hartree
zpe.sumelectthermalfe: -595.256736 hartree
dipole: -2.4830 3.0860 -0.2867
dipole: 3.9713
quadrupole: -81.7359 -75.5542 -86.1993
quadrupole: 7.1355 0.6661 -0.5086
quadrupole: -0.5727 5.6089 -5.0362 7.1355 0.6661 -0.5086
hfenergy: -595.4652557 hartree
pointgroup: C01 [X(C12H15N1O1)]
dipole: 1.0614345 -1.1414021 -0.1081132 debye
polarizability: 168.413834|-3.1571703|157.7763767|-1.279335|1.6161753|80.9650943 unknown
InChI: InChI=1S/C12H15NO/c14-11-6-5-9-3-1-7-13-8-2-4-10(11)12(9)13/h5-6,14H,1-4,7-8H2
charge 0 multiplicity 1
29 atoms
O  -3.506198 0.088503 -0.065142
N  1.326968 -0.911634 -0.059408
C  0.257297 0.010242 -0.054025
C  1.060244 -2.329341 -0.346273
C  2.709344 -0.44121 -0.256872
C  -1.095798 -0.464136 -0.046699
C  -0.199931 -2.800234 0.39988
C  0.517727 1.419966 -0.04234
C  2.943064 0.896982 0.466832
C  -1.415807 -1.956724 -0.039338
C  1.947893 1.948651 -0.063988
C  -2.148871 0.484981 -0.045513
C  -0.57168 2.315653 -0.020193
C  -1.909017 1.874199 -0.029224
H  1.938708 -2.917361 -0.019628
H  0.932811 -2.507352 -1.440991
H  2.944291 -0.320303 -1.341287
H  3.392903 -1.216551 0.139989
H  -0.033144 -2.682321 1.486462
H  -0.37982 -3.871881 0.195513
H  3.98619 1.226573 0.304587
H  2.797104 0.749253 1.553396
H  -2.255031 -2.177138 0.6560
H  -1.745039 -2.287294 -1.047775
H  2.236967 2.225442 -1.099913
H  2.013676 2.876865 0.53444
H  -0.364175 3.393109 -0.003851
H  -2.754118 2.567018 -0.023992
H  -3.583859 -0.897459 -0.060549
