program: Gaussian 09
title: 000170486
version: EM64L-G09RevD.01
frameworkgroup: C1[X(C15H22O2)]
method: RPBEPBE
basis: SDD
operation: Freq
keyword: #pfreq=noraman
keyword: PBEPBE/SDD
title: #p freq=noraman PBEPBE/SDD
converged: YES YES NO NO
title: Mulliken charges:
elementType: O O C C C C C C C C C C C C C C C H H H H H H H H H H H H H H H H H H H H H H
charge: -0.261510 -0.253210 -0.024952 -0.587894 0.491253 -0.356657 0.498506 -0.704403 -0.702817 -0.406792 -0.403477 -0.397478 -0.460261 -0.698534 0.250954 -0.227415 -0.674419 0.199121 0.208004 0.206584 0.240526 0.231555 0.203851 0.211075 0.210661 0.231885 0.204512 0.230946 0.231195 0.260366 0.230174 0.218924 0.228991 0.241616 0.228278 0.229115 0.211031 0.231877 0.228819
chargesum: 0.00000
title: Mulliken charges with hydrogens summed into heavy atoms:
elementType: O O C C C C C C C C C C C C C C C
charge: -0.261510 -0.253210 0.174169 -0.173306 0.491253 -0.116131 0.498506 -0.057923 -0.055759 -0.175845 -0.172282 -0.137112 -0.230086 -0.009003 0.250954 0.229977 -0.002692
polarizability: 2.09969990e+02 5.33243614e+00 1.42561663e+02 4.76649590e-01 -4.11413992e+00 1.53839833e+02
1716.lowfreq: -12.7746 -4.5180 0.0006 0.0008 0.0009 7.4444 13.7653 21.7727 45.2115
frequency: 13.4429 21.4011 45.1335 49.8085 61.2391 84.0777 99.2796 131.4232 135.4346 163.8974 200.4976 218.9111 224.4464 236.6688 249.8552 261.1655 276.9948 320.6146 331.8275 355.9782 379.9034 393.4334 398.9851 409.0707 457.3182 543.7865 586.7248 632.0763 669.5913 701.6453 726.7230 772.5941 779.7903 800.0050 809.1756 820.2613 846.2659 857.4340 878.7119 882.7819 922.5639 949.9919 960.1949 963.0983 977.0860 990.3177 1015.3796 1022.3669 1066.3645 1070.4398 1083.7884 1087.3204 1112.5637 1121.1608 1132.0960 1135.5593 1180.4619 1192.5817 1204.0507 1220.7715 1224.7654 1247.8634 1268.9004 1270.3192 1312.3818 1322.4616 1335.7733 1347.8369 1356.3414 1376.8415 1384.3074 1385.9061 1395.0118 1399.7603 1413.7317 1463.1948 1464.6502 1468.0297 1469.9527 1473.3903 1474.4866 1474.7890 1483.2402 1486.5100 1489.7088 1503.7108 1580.5617 1619.3426 1631.6933 2956.6918 2970.3340 2972.1237 2979.7026 2990.3713 2995.5846 3010.6748 3029.3954 3041.5056 3062.7705 3067.2747 3069.1089 3070.8728 3076.9605 3087.8199 3091.9540 3103.6506 3107.5014 3111.4799 3117.8794 3134.9016 3143.7463
redmass: 3.8219 3.2826 3.0235 3.2847 3.5056 2.9312 3.6756 3.1250 3.2131 2.6984 2.3790 1.0510 1.2245 1.9804 1.1135 1.7002 3.5986 4.1362 3.8972 2.7297 2.6526 2.1874 3.3559 2.8419 3.2260 3.0175 3.1486 6.2452 3.9880 3.6470 4.3844 3.6159 3.3185 1.1165 3.1888 3.2324 1.5519 1.3825 3.5175 1.5419 1.2104 1.6373 1.5231 1.6736 1.3991 1.9823 2.8975 2.1946 1.8483 1.9554 2.1283 1.4858 2.2819 2.2785 1.5703 1.4703 2.0724 1.2283 2.0456 2.5629 1.2726 1.1418 1.4796 1.5814 1.4486 1.4555 1.3679 1.3793 1.4504 1.2272 3.5816 1.3212 1.2183 1.2686 2.4535 1.0401 1.0459 1.0925 1.0526 1.0591 1.0568 1.0551 1.0545 1.0693 1.0581 2.5329 6.5139 6.4714 9.0706 1.0774 1.0351 1.0412 1.0601 1.0351 1.0358 1.0582 1.1023 1.0848 1.0998 1.0987 1.1065 1.0998 1.0990 1.1001 1.0985 1.1004 1.1026 1.0871 1.0877 1.0961 1.0967
irintensity: 0.6487 0.2666 0.1373 0.1802 1.7670 0.1648 0.0651 1.0975 1.8279 3.9369 1.2603 0.0489 1.1162 0.4166 0.0808 3.1283 3.4948 5.4255 2.9295 2.6254 1.8804 0.2733 1.5981 0.1839 6.3325 21.9280 5.4830 0.5498 3.0973 9.4439 3.5354 1.9117 5.2135 3.7454 4.3533 4.5312 26.0416 18.6748 7.4628 0.7713 2.0231 0.1186 0.0729 0.0484 0.3879 4.5003 9.4892 42.2444 8.3555 96.9363 71.4833 3.8964 21.9398 187.6147 79.6717 7.4399 5.9594 2.8677 2.7878 4.8848 0.9146 0.1058 19.2952 8.1102 46.7960 11.0299 6.4167 6.8823 3.4186 21.8045 7.7056 15.5325 13.9839 20.0919 9.0976 11.2068 3.7451 3.7584 9.4056 9.0781 5.2858 0.4494 21.8513 13.5709 17.1185 34.8969 0.3443 13.3348 130.7598 18.4444 42.8862 39.3230 56.1251 31.7783 21.6274 17.9372 20.1010 7.7526 20.9976 64.0525 8.5670 7.1988 101.9017 38.1629 29.3797 16.8986 45.4385 12.4972 14.9450 28.8036 2.0634
temp: 298.150 k
press: 1.00000 atm
elementType: 8 8 6 6 6 6 6 6 6 6 6 6 6 6 6 6 6 1 1 1 1 1 1 1 1 1 1 1 1 1 1 1 1 1 1 1 1 1 1
symmnumber: 1
zpe: 876589.4 jmol-1
zpe.correction: 0.333875 hartree
zpe.thermalcorrener: 0.352949 hartree
zpe.thermalcorrenthalpy: 0.353893 hartree
zpe.thermalcorrgfe: 0.284083 hartree
zpe.sumelectzpe: -733.947318 hartree
zpe.sumelectthermal: -733.928245 hartree
zpe.sumelectthermalent: -733.927301 hartree
zpe.sumelectthermalfe: -733.997111 hartree
dipole: 0.2762 1.1432 -1.3957
dipole: 1.8252
quadrupole: -92.6415 -100.5642 -104.4945
quadrupole: -4.6940 4.4701 2.2350
quadrupole: 6.5919 -1.3308 -5.2611 -4.6940 4.4701 2.2350
hfenergy: -734.2811934 hartree
pointgroup: C01 [X(C15H22O2)]
dipole: 0.0488425 0.2185098 -0.6822748 debye
polarizability: 208.3712802|10.2978027|142.4598501|-5.0365233|0.1883364|155.5403554 unknown
InChI: InChI=1S/C15H22O2/c1-5-17-15(16)12(4)14-8-6-13(7-9-14)10-11(2)3/h6-9,11-12H,5,10H2,1-4H3
charge 0 multiplicity 1
39 atoms
O  -3.396228 0.255439 -0.298683
O  -2.929124 -0.078741 1.958733
C  4.153268 1.179673 -0.301373
C  3.799925 -0.298613 0.083768
C  2.314462 -0.628984 0.126879
C  -1.979818 -1.617598 0.256554
C  -0.490775 -1.240316 0.210927
C  3.704453 1.533833 -1.738352
C  3.597959 2.201408 0.717865
C  1.560917 -0.470638 1.320616
C  1.632011 -1.104068 -1.023047
C  0.182836 -0.768522 1.36655
C  0.251315 -1.400795 -0.984006
C  -2.230727 -2.854154 1.158717
C  -2.800638 -0.428823 0.7615
C  -4.17607 1.480981 0.0656
C  -4.763378 2.030224 -1.230104
H  5.262385 1.238636 -0.269563
H  4.249931 -0.504624 1.075141
H  4.304499 -0.965757 -0.643001
H  -2.31521 -1.833444 -0.772763
H  2.603421 1.498538 -1.829342
H  4.131057 0.830834 -2.479044
H  4.034486 2.554149 -2.009274
H  3.933015 3.224751 0.465084
H  2.49264 2.197738 0.72083
H  3.942251 1.975465 1.745004
H  2.065315 -0.114815 2.227414
H  2.189299 -1.248955 -1.956742
H  -0.377302 -0.628086 2.298447
H  -0.25188 -1.766238 -1.887822
H  -3.292826 -3.158329 1.12989
H  -1.612007 -3.70132 0.81569
H  -1.968408 -2.627734 2.205893
H  -4.951762 1.193552 0.79821
H  -3.487444 2.192912 0.555742
H  -5.347748 2.944407 -1.018709
H  -3.964701 2.286631 -1.946921
H  -5.432602 1.291986 -1.704205
