program: Gaussian 09
title: 000170514
version: EM64L-G09RevD.01
frameworkgroup: C1[X(C22H24O4)]
method: RPBEPBE
basis: SDD
operation: Freq
keyword: #pfreq=noraman
keyword: PBEPBE/SDD
title: #p freq=noraman PBEPBE/SDD
converged: YES YES NO NO
title: Mulliken charges:
elementType: O O O O C C C C C C C C C C C C C C C C C C C C C C H H H H H H H H H H H H H H H H H H H H H H H H
charge: -0.382865 -0.369089 -0.332417 -0.171166 -0.009377 -0.419965 -0.608924 -0.423898 -0.366080 0.518843 -0.355909 -0.106265 -0.720994 0.098858 -0.674991 0.198483 0.139242 -0.067678 -0.696795 -0.212644 0.291781 0.256656 -0.375868 -0.384406 -0.232043 -0.224119 0.246159 0.186467 0.204072 0.232126 0.212735 0.207016 0.212181 0.190939 0.198764 0.195471 0.192451 0.217549 0.225426 0.220009 0.237093 0.209139 0.211635 0.216126 0.390552 0.291828 0.294398 0.360160 0.239935 0.239397
chargesum: 0.00000
title: Mulliken charges with hydrogens summed into heavy atoms:
elementType: O O O O C C C C C C C C C C C C C C C C C C C C C C
charge: 0.007687 -0.008928 -0.332417 -0.171166 0.236782 -0.029426 -0.164063 -0.004701 0.023624 0.518843 0.032013 -0.106265 -0.058010 0.098858 -0.437899 0.198483 0.139242 -0.067678 -0.059894 -0.212644 0.291781 0.256656 -0.084040 -0.090009 0.007892 0.015278
polarizability: 4.04508181e+02 -1.93227546e+01 2.51848061e+02 -6.01639177e+01 -3.42895844e+01 1.88134769e+02
1716.lowfreq: -25.2036 -6.6970 -3.5140 0.0005 0.0005 0.0007 5.9220 18.9769 25.3232
frequency: -21.3084 18.7191 25.1907 39.1637 54.5954 60.6194 74.4523 93.7141 107.9414 119.8358 135.2779 148.7483 167.8364 186.0205 194.0272 207.4353 228.4422 248.4663 253.9202 274.0872 293.6538 295.2172 309.9282 340.9838 355.0017 384.1682 404.9679 407.9718 420.2146 423.5980 431.0451 442.4788 448.4261 477.2604 488.9237 504.7293 519.7479 536.2691 603.3394 626.4291 643.0284 664.4861 689.7693 716.6012 725.7527 733.2928 741.9362 760.4409 784.4697 807.5602 814.4703 822.7527 861.0934 869.6988 876.1465 883.3109 890.9542 913.4560 931.0037 936.5080 965.9488 987.0947 998.6564 1007.0027 1016.9962 1018.1698 1020.7733 1033.9137 1045.0359 1075.6710 1081.5318 1084.3720 1097.6253 1111.7666 1127.7826 1147.5081 1167.9441 1176.2947 1185.6532 1192.7771 1215.7901 1233.7008 1256.3675 1259.0971 1265.3793 1268.0045 1277.9726 1282.9374 1285.8644 1288.0195 1308.2992 1314.1647 1329.4180 1340.4044 1351.5677 1354.6686 1360.7585 1387.6260 1390.5386 1397.5277 1400.7216 1433.4242 1441.3958 1449.2981 1458.6204 1463.2254 1466.2234 1473.0603 1474.9982 1476.8659 1477.9403 1483.2040 1485.7490 1491.0180 1522.2138 1551.1865 1580.1416 1602.8829 1608.5067 1618.0719 2514.1493 2949.8924 2956.6894 2966.3087 2972.3092 2972.7400 2978.1002 2984.9454 2987.7428 2994.8549 3007.8118 3025.4379 3033.3823 3050.4846 3068.1404 3071.0527 3071.3972 3073.2341 3103.1745 3136.5666 3152.5703 3164.3085 3173.2123 3528.9574
redmass: 3.0551 4.0882 5.1967 4.1834 5.6734 1.7628 3.8491 2.8780 3.9318 3.7828 2.2714 6.7334 6.0771 2.3264 2.1149 5.6072 1.1473 1.9198 4.6198 3.4233 2.5931 5.7207 2.7006 4.9747 6.4414 5.2847 1.3716 3.5843 4.2780 3.2780 9.6683 3.8922 7.6229 3.5105 7.3264 3.5163 3.7619 4.1366 4.5219 4.7920 6.1205 4.8934 5.4567 5.3314 1.1598 2.7596 3.9462 1.3765 1.3382 1.8085 3.7328 2.4118 2.8643 1.6500 6.1415 1.9497 1.9532 4.2372 1.4193 1.8622 2.1276 1.9587 1.3844 1.0636 1.3722 2.5775 1.6367 3.0801 2.4022 2.4091 2.6365 2.1498 2.3791 1.9624 1.8648 1.9745 1.2388 1.4181 2.0954 1.5219 1.4278 1.7123 1.3375 1.3169 1.6329 1.2516 2.4542 1.4117 3.2582 1.0789 2.2124 1.7496 1.5284 1.4814 1.8675 2.3502 1.5275 1.2379 1.2167 8.0280 6.8926 5.6663 2.4488 2.5625 1.1586 1.0765 1.0782 2.6253 1.0846 1.0841 1.0425 1.0560 1.0727 1.0774 8.2432 5.2672 6.6921 3.2054 6.2131 6.3311 1.0761 1.0600 1.0588 1.0598 1.0369 1.0675 1.0384 1.0669 1.0736 1.0890 1.0994 1.0995 1.1037 1.1026 1.1005 1.0988 1.0993 1.1001 1.0910 1.0864 1.0904 1.0947 1.0998 1.0657
irintensity: 0.0243 0.1123 0.0519 2.5563 4.9290 0.0869 0.0428 0.0620 0.1546 0.0664 0.0424 0.4537 0.1060 0.6943 1.4595 0.2896 0.0127 0.0100 0.4189 1.1197 0.4754 3.9278 0.3767 4.3380 6.4927 4.0812 73.6140 20.2587 7.1916 15.8760 19.3344 13.2711 7.8351 1.0591 3.6965 1.4040 13.2240 6.1364 9.5994 7.0622 4.7596 7.8943 2.2665 3.3760 7.3467 25.2118 11.3240 21.7115 3.2221 40.3486 9.9530 1.9626 1.0176 8.3782 16.9695 17.6771 7.3395 39.7602 3.0555 0.4157 13.9943 6.7226 0.8680 117.8263 0.6653 39.0300 6.6190 1.8811 21.3609 0.2135 3.8299 20.1231 51.0243 20.0759 0.4051 18.1759 49.5249 44.3133 13.8486 6.1388 9.6948 43.2404 57.1791 0.9617 24.0099 4.8777 44.7634 53.0629 459.4774 1.6942 35.6917 39.8986 10.1429 16.2869 60.8128 95.1491 10.9457 23.2357 12.9002 37.9166 122.2642 138.1366 108.8540 40.3767 33.2504 3.8617 1.2908 26.0014 3.1015 5.4701 12.4763 7.9299 23.8419 2.2599 178.8896 65.8803 0.8291 22.0944 7.6385 1.9178 198.5876 6.7262 1.9370 73.3655 38.6271 5.5850 29.1531 37.5716 15.7559 20.5854 10.4037 23.4195 81.1196 24.8185 80.4869 49.5707 61.7956 60.8867 17.3902 4.3209 9.0700 3.3677 30.4332 40.3764
temp: 298.150 k
press: 1.00000 atm
elementType: 8 8 8 8 6 6 6 6 6 6 6 6 6 6 6 6 6 6 6 6 6 6 6 6 6 6 1 1 1 1 1 1 1 1 1 1 1 1 1 1 1 1 1 1 1 1 1 1 1 1
symmnumber: 1
zpe: 1064834.4 jmol-1
zpe.correction: 0.405574 hartree
zpe.thermalcorrener: 0.429447 hartree
zpe.thermalcorrenthalpy: 0.430391 hartree
zpe.thermalcorrgfe: 0.351236 hartree
zpe.sumelectzpe: -1151.773448 hartree
zpe.sumelectthermal: -1151.749575 hartree
zpe.sumelectthermalent: -1151.748630 hartree
zpe.sumelectthermalfe: -1151.827785 hartree
dipole: 1.8026 0.1221 -0.3001
dipole: 1.8315
quadrupole: -134.0533 -163.4218 -150.2282
quadrupole: 11.1946 -14.5738 -2.1910
quadrupole: 15.1811 -14.1874 -0.9937 11.1946 -14.5738 -2.1910
hfenergy: -1152.1790215 hartree
pointgroup: C01 [X(C22H24O4)]
dipole: 0.7089571 0.002206 -0.1288018 debye
polarizability: 400.5681175|-32.8925646|247.6049877|-61.8603656|-36.5080166|196.3179057 unknown
InChI: InChI=1S/C22H24O4/c1-3-5-8-13(4-2)11-14-12-17(23)18-19(20(14)24)22(26)16-10-7-6-9-15(16)21(18)25/h6-7,9-10,12-13,23-24H,3-5,8,11H2,1-2H3
charge 0 multiplicity 1
50 atoms
O  0.546102 -2.369485 0.054178
O  -0.369877 2.638804 -2.278701
O  -1.731836 -2.327077 1.020442
O  -2.820894 2.627602 -1.184731
C  3.574535 -1.156658 -0.174736
C  4.082952 0.290309 0.058243
C  2.660229 -1.238521 -1.446075
C  4.715212 -2.211636 -0.261064
C  4.888666 0.485451 1.363382
C  1.334182 -0.532276 -1.277813
C  5.236762 1.966591 1.639082
C  0.294491 -1.138358 -0.49671
C  5.735632 -1.997145 -1.402702
C  -0.963429 -0.475329 -0.311095
C  1.062919 0.714843 -1.851146
C  -1.219474 0.816995 -0.903333
C  -0.180087 1.395959 -1.678504
C  -1.978818 -1.156527 0.498877
C  6.053314 2.16267 2.934659
C  -2.530554 1.489539 -0.693474
C  -3.283834 -0.509321 0.720541
C  -3.548594 0.766047 0.145707
C  -4.271828 -1.15847 1.505709
C  -4.806884 1.377214 0.366111
C  -5.518452 -0.541193 1.718234
C  -5.785751 0.730305 1.146214
H  2.943916 -1.442288 0.692095
H  4.702245 0.612913 -0.805553
H  3.209268 0.973958 0.083416
H  2.468495 -2.308473 -1.652541
H  3.199751 -0.813909 -2.313936
H  4.250662 -3.212052 -0.372346
H  5.256441 -2.232993 0.704897
H  4.305473 0.082447 2.217962
H  5.828701 -0.101541 1.323484
H  4.29867 2.555612 1.69934
H  5.804397 2.373968 0.777035
H  6.500889 -2.794773 -1.392753
H  5.251087 -2.018068 -2.396251
H  6.262727 -1.03049 -1.303269
H  1.844517 1.188786 -2.46161
H  7.010826 1.609793 2.888197
H  5.494914 1.790436 3.814346
H  6.287242 3.228948 3.109694
H  -0.328575 -2.642207 0.574297
H  -4.035045 -2.137805 1.932216
H  -4.986915 2.357363 -0.086448
H  0.443213 2.905155 -2.781615
H  -6.282015 -1.040432 2.32401
H  -6.756572 1.209617 1.312439
