program: Gaussian 09
title: 000170469
version: EM64L-G09RevD.01
frameworkgroup: C1[X(C7H12O4S2)]
method: RPBEPBE
basis: SDD
operation: Freq
keyword: #p
keyword: freq=noraman
keyword: PBEPBE/SDD
title: #p freq=noraman PBEPBE/SDD
converged: YES YES NO NO
title: Mulliken charges:
elementType: S S O O O O C C C C C C C H H H H H H H H H H H H
charge: 0.948967 0.950187 -0.528063 -0.523927 -0.512238 -0.536673 -0.227665 -0.667334 -0.673054 -0.307534 -0.295247 -0.413878 -0.433865 0.304362 0.246889 0.244153 0.306012 0.246519 0.244055 0.286801 0.291925 0.243342 0.283343 0.245306 0.277616
chargesum: 0.00000
title: Mulliken charges with hydrogens summed into heavy atoms:
elementType: S S O O O O C C C C C C C
charge: 0.948967 0.950187 -0.528063 -0.523927 -0.512238 -0.536673 -0.227665 0.128070 0.123533 -0.020733 -0.003321 0.112807 0.089057
polarizability: 1.87540021e+02 -3.02521226e-01 1.28329996e+02 5.36557907e+00 8.56292865e+00 1.21496021e+02
1716.lowfreq: -15.2332 -9.4065 -3.6028 -0.0004 -0.0003 0.0017 24.2424 42.8764 72.1290
frequency: 22.7226 42.8517 72.0902 86.1736 103.1765 130.1736 137.6181 164.8114 180.7989 185.6184 197.3463 201.5604 222.3174 241.5706 251.5476 262.7684 283.9129 292.1684 348.2740 361.0191 374.1127 412.2776 417.9877 465.3480 487.8585 532.8778 545.0512 618.2484 631.7933 780.8709 799.2132 868.1951 918.0179 923.1514 932.6980 945.1248 947.9319 961.6300 974.5141 975.6519 999.8526 1002.5027 1080.9804 1146.3329 1187.1197 1190.7816 1242.1194 1370.1159 1371.4378 1384.4105 1395.6258 1436.4313 1441.6284 1457.3597 1459.1057 1606.1285 1608.1403 2973.3158 2976.4093 3063.0151 3067.8800 3083.9644 3084.4439 3084.7645 3086.2301 3178.8508 3183.1244 3203.1681 3204.3568
redmass: 4.3384 6.9091 4.3341 3.1919 6.3326 1.2833 4.0053 3.2464 2.1478 4.1528 4.3174 5.1210 1.4270 3.7035 2.9406 3.4098 5.0204 5.1685 4.5644 4.7839 4.1524 4.0704 3.1412 4.1180 3.3618 4.2115 5.3662 1.6912 1.7671 17.2347 14.3095 3.3731 3.2866 3.0738 1.2076 1.2804 1.2172 1.2631 1.7498 1.6745 1.2722 1.2339 1.6562 1.7541 1.2943 1.3085 5.6592 1.1530 1.1538 1.1949 1.1871 1.0452 1.0465 1.0426 1.0476 4.6961 4.6759 1.0354 1.0356 1.0982 1.0975 1.0606 1.0858 1.0703 1.1003 1.1031 1.1039 1.1138 1.1126
irintensity: 1.7854 1.6062 1.0026 0.3199 0.7809 1.3048 3.6747 3.7806 3.7310 2.2546 0.4521 2.5337 1.5523 10.6185 3.7252 11.3763 24.0657 2.7001 6.8858 25.7124 3.2251 8.3417 3.0337 2.0824 28.5351 80.2283 13.5635 127.1527 36.7606 26.9593 78.0902 7.4766 20.5337 69.9906 16.9261 2.9718 6.9488 1.0287 25.1118 21.8676 72.7490 79.8082 85.5051 25.9469 38.4173 8.9864 0.3921 26.6373 26.5288 57.0582 17.6291 6.5682 4.3078 12.5362 32.6051 5.3032 5.7216 0.7213 15.5731 3.3473 14.3053 3.0809 1.4278 1.9977 0.9399 1.6461 1.3122 1.3711 1.6255
temp: 298.150 k
press: 1.00000 atm
elementType: 16 16 8 8 8 8 6 6 6 6 6 6 6 1 1 1 1 1 1 1 1 1 1 1 1
symmnumber: 1
zpe: 465770.0 jmol-1
zpe.correction: 0.177402 hartree
zpe.thermalcorrener: 0.194994 hartree
zpe.thermalcorrenthalpy: 0.195938 hartree
zpe.thermalcorrgfe: 0.131998 hartree
zpe.sumelectzpe: -1369.531729 hartree
zpe.sumelectthermal: -1369.514137 hartree
zpe.sumelectthermalent: -1369.513193 hartree
zpe.sumelectthermalfe: -1369.577133 hartree
dipole: 0.5775 -6.9760 6.9760
dipole: 9.8825
quadrupole: -72.2237 -101.8488 -98.3290
quadrupole: 7.6245 6.3923 0.4238
quadrupole: 18.5768 -11.0483 -7.5285 7.6245 6.3923 0.4238
hfenergy: -1369.709131 hartree
pointgroup: C01 [X(C7H12O4S2)]
dipole: -0.1750683 -3.7414324 1.0431229 debye
dipolederiv: 1.652791 0.0593187 -0.0338697 0.3159434 0.9122795 -0.1998176 -0.1414823 0.0556622 0.9989072 1.6004227 -0.0763312 -0.1452492 -0.4207062 1.0335965 -0.0318342 0.132395 -0.0431943 0.8968729 -0.6282156 -0.0781692 0.000172 -0.0879141 -0.5681369 0.0163003 -0.0433175 -0.1259864 -0.4267563 -0.6784061 -0.0710305 0.0675716 -0.0541605 -0.4337129 -0.0229156 0.1077948 0.0440739 -0.6511914 -0.6367563 0.0622298 -0.0114882 0.0950011 -0.5230611 0.043094 -0.0925604 0.1617301 -0.4888876 -0.6293445 0.1005899 0.0578571 0.0959981 -0.4887547 -0.0295305 0.0475671 -0.1220932 -0.5895296 0.1454772 0.0224447 0.0424901 -0.0000434 0.2109118 0.0320069 0.0047545 -0.0297869 0.0311214 -0.3836746 0.0068417 0.0139416 0.0112986 -0.1893426 0.0896615 0.0253397 -0.0194463 -0.2131986 -0.371948 0.0024433 -0.0085729 0.0185701 -0.2036626 -0.1187097 0.0424862 0.0174667 -0.1847785 -0.1330438 -0.14368 0.0634352 -0.2602636 -0.1470098 0.0994081 0.1713598 0.0494596 -0.1791812 -0.096134 0.1387942 0.0413497 0.3015282 -0.2590107 0.048588 -0.0101705 0.0401976 -0.0879021 -0.2757204 -0.0782138 0.0018054 0.0854125 -0.0987769 0.1279091 0.0364294 0.050621 -0.1321347 -0.2655598 0.0626733 0.045282 -0.046944 -0.2118992 0.0852353 -0.0849276 0.0120565 -0.0354516 0.1593347 -0.0209026 0.0014007 -0.0385611 0.0526556 -0.0753794 -0.020866 -0.0296684 0.0822932 0.0015844 0.1110254 -0.0212574 0.1336013 0.0541939 0.0137211 -0.0644083 0.0262423 0.0870124 0.0033437 -0.1099498 0.0365868 -0.1153705 0.0502935 0.0315356 0.0800156 0.0475666 0.0605968 0.1658728 0.0130373 0.0054445 0.0260342 0.0869834 0.0845705 -0.031018 0.0305302 0.0592636 -0.0322879 -0.1100979 0.0045313 -0.1461019 0.0556031 0.015208 -0.0125309 -0.0120036 0.1023914 0.0188833 0.112905 0.0104672 0.1395537 0.0059051 -0.0148716 0.0308273 -0.0363624 0.0908839 0.0195601 0.0718525 -0.0812455 0.1315576 0.0454614 -0.0315345 -0.1112676 -0.0425091 0.0732821 -0.0108589 -0.093803 0.019197 -0.1624581 0.1120089 -0.0241899 0.0066474 -0.0329265 0.0329785 0.0136132 0.0915502 -0.0735779 0.0585959 0.1280384 -0.014826 -0.1184468 0.0105878 0.1351618 0.1838516 0.0604889 0.0326055 0.0260074 0.0814461 -0.0523417 0.0307788 -0.0250957 0.1391581 -0.0119547 -0.1063385 -0.0078811 -0.1054004 0.1527732 -0.0193383 0.0499054 -0.002003 0.1297385 0.1891699 -0.0276782 -0.0609958 -0.0011782 0.1412171 -0.0519494 -0.0353048 -0.0251187 0.0693497 unknown
polarizability: 187.6589958|4.70331|115.7832743|-0.8197797|1.1646053|133.9237678 unknown
InChI: InChI=1S/C7H12O4S2/c1-5-12(8,9)7(3,4)13(10,11)6-2/h5-6H,1-2H2,3-4H3
charge 0 multiplicity 1
25 atoms
S  1.630451 0.347643 -0.708811
S  -1.502126 0.607279 -0.130654
O  1.62481 1.69965 0.204979
O  1.737894 0.343926 -2.340416
O  -1.39853 1.587753 -1.428812
O  -1.579511 1.139372 1.414191
C  0.003276 -0.774446 -0.211394
C  0.167411 -1.305111 1.193445
C  -0.248069 -1.704832 -1.376725
C  3.111704 -0.703168 -0.112863
C  -3.075754 -0.445088 -0.402055
C  3.817837 -0.243553 0.933851
C  -3.872549 -0.66031 0.658284
H  0.219845 -0.476847 1.922901
H  1.081288 -1.921533 1.277591
H  -0.695669 -1.943359 1.462525
H  -0.260628 -1.148603 -2.331343
H  -1.203076 -2.246072 -1.244312
H  0.553041 -2.465558 -1.442494
H  3.309218 -1.551957 -0.773854
H  -3.234727 -0.685747 -1.456925
H  4.728413 -0.753338 1.270189
H  3.503917 0.669697 1.45732
H  -4.828912 -1.185135 0.548709
H  -3.589355 -0.287364 1.65177
