program: Gaussian 09
title: 000001309
version: EM64L-G09RevD.01
frameworkgroup: C1[X(C21H21NO6)]
method: RPBEPBE
basis: SDD
operation: Freq
keyword: #p
keyword: freq=noraman
keyword: PBEPBE/SDD
title: #p freq=noraman PBEPBE/SDD
converged: YES YES NO NO
title: Mulliken charges:
elementType: O O O O O O N C C C C C C C C C C C C C C C C C C C C C H H H H H H H H H H H H H H H H H H H H H
charge: -0.248438 -0.261538 -0.265474 -0.293546 -0.234724 -0.282915 -0.107493 -0.255364 -0.238813 0.351609 -0.473346 0.328811 -0.558237 0.405093 -0.468903 -0.640921 -0.059996 -0.516348 0.159014 0.124497 0.169929 -0.411372 0.100646 -0.338270 0.180885 -0.205700 -0.527689 -0.521453 0.241646 0.270212 0.226274 0.226970 0.225127 0.234268 0.276453 0.223697 0.233065 0.216162 0.256932 0.280166 0.257263 0.239411 0.232037 0.293917 0.229395 0.217858 0.266404 0.212584 0.230217
chargesum: 0.00000
title: Mulliken charges with hydrogens summed into heavy atoms:
elementType: O O O O O O N C C C C C C C C C C C C C C C C C C C C C
charge: -0.248438 -0.261538 -0.265474 -0.293546 -0.234724 -0.282915 -0.107493 -0.013718 0.031400 0.351609 -0.020102 0.328811 -0.098842 0.405093 -0.192450 0.032002 -0.059996 -0.259416 0.159014 0.124497 0.169929 -0.131206 0.100646 -0.081007 0.180885 0.265748 0.213481 0.187752
polarizability: 3.51886464e+02 8.49468440e+00 2.83310644e+02 2.01314111e+01 -9.83611705e+00 1.49702584e+02
1716.lowfreq: -4.2651 -1.5349 -0.0009 -0.0009 -0.0007 5.7512 16.9476 31.4387 39.9205
frequency: 16.8638 31.4369 39.8957 55.0225 68.5035 70.8298 93.1836 94.5900 95.6676 120.3285 134.4555 143.6744 160.9317 163.0791 173.4782 197.7196 210.2250 218.1134 231.7637 241.2247 272.5483 274.0974 287.7948 305.2751 311.2948 348.1214 364.8610 379.1113 410.7699 423.9736 429.5872 465.5871 468.6887 492.6249 501.3011 524.8923 532.4272 564.7983 583.2013 602.1900 628.8335 640.9140 672.0821 678.1701 689.5813 701.5032 708.7648 723.7453 743.5280 768.4798 775.7260 802.9369 822.5672 837.3217 843.7788 858.4198 863.7393 877.7619 919.1531 923.1060 940.0841 950.1473 956.0518 961.5604 973.2115 1002.5403 1010.0863 1034.0935 1036.0799 1043.3323 1062.4270 1072.2670 1110.6978 1111.1317 1119.3541 1122.4574 1128.2429 1142.8583 1150.9196 1154.7685 1157.5032 1168.0765 1188.5004 1194.3729 1197.9516 1214.5318 1226.4712 1241.7135 1248.7238 1257.6366 1270.5269 1284.4732 1313.5173 1321.8106 1347.5837 1359.8946 1360.8536 1371.3256 1398.7662 1411.7666 1420.0375 1420.5396 1436.1404 1441.4849 1451.9385 1454.3287 1456.1394 1466.0232 1468.6444 1469.7681 1471.2050 1484.4721 1485.3054 1487.8719 1491.1603 1584.7203 1593.2762 1621.6541 1623.9191 1675.0300 2905.0989 2965.0803 2977.5728 2986.6196 2987.8361 2995.8295 3001.3070 3021.6918 3021.8353 3023.7844 3051.7155 3076.9512 3087.5326 3100.1325 3111.0537 3131.5082 3133.3614 3157.2848 3157.9511 3185.1853 3187.2588
redmass: 6.3151 4.6440 5.2949 3.9636 3.9654 2.9927 2.5309 2.3395 3.2189 2.4629 5.0500 1.7774 3.6971 2.2373 2.6160 4.0089 1.1597 3.1943 4.8800 4.0548 3.7179 5.3989 4.8288 5.7685 4.1862 4.8275 5.5411 4.4314 4.2532 3.3144 4.3434 4.4401 4.8227 3.3490 5.1539 5.0919 5.7256 4.6399 5.1629 8.0728 4.8376 5.3773 5.0228 8.4766 8.1991 6.8761 4.5686 4.3849 5.5926 6.0100 4.2251 3.7609 3.3497 3.9388 2.8475 3.4599 1.4432 1.5407 5.9656 2.8406 5.9458 4.1585 3.3724 1.4855 5.9395 4.1940 3.4464 2.6745 4.1408 2.1393 3.3686 1.5010 1.6920 1.3538 1.2392 1.4696 1.0845 1.4483 1.6687 1.4021 1.3861 2.9870 1.7963 1.7674 1.6208 2.2391 1.6021 1.5575 2.4207 3.1479 2.7786 1.8109 1.2878 1.4410 1.2812 1.3240 1.4948 4.3670 4.0339 4.7060 1.4226 3.5624 1.2475 1.3794 1.0530 1.1330 1.1389 1.1225 1.1296 1.8489 1.9840 1.3913 1.0572 1.0623 1.0561 7.4353 8.6767 8.4942 8.7047 11.6555 1.0502 1.0630 1.0346 1.0314 1.0628 1.0617 1.0833 1.0879 1.0873 1.0856 1.1039 1.1009 1.0973 1.1016 1.1093 1.1049 1.1057 1.0927 1.0895 1.0928 1.0956
irintensity: 0.3477 0.5197 0.5799 1.2584 1.8408 2.3345 0.4445 18.5011 6.1443 4.6518 0.2237 0.2641 0.8682 3.2950 3.3779 1.8452 0.6710 0.4933 2.8936 3.3608 6.7104 2.8195 1.9859 0.6299 10.1301 0.0671 0.8209 1.5438 2.8724 4.5159 2.8577 5.1956 1.3401 12.5078 36.6977 13.0658 0.0693 1.7227 7.9944 5.7251 1.8833 31.0641 7.5512 2.7012 11.4966 2.7643 4.5433 1.6787 1.2120 15.1330 24.9458 8.8767 6.2830 24.1155 55.3422 62.9366 8.9501 32.2058 19.7733 22.6926 98.5581 130.0616 40.6250 16.0146 150.7172 37.3465 19.5940 9.2405 26.9009 21.9710 30.7614 8.6604 25.3075 18.2452 9.7333 1.5471 1.0564 18.0649 6.0717 9.2900 6.0353 27.4500 9.3112 44.3178 49.4130 58.9103 65.2442 27.7051 81.5871 186.9096 110.7702 25.4306 2.4456 4.3024 5.6921 3.6701 14.0740 68.3126 0.9949 3.2378 23.9732 4.7158 12.4996 14.8458 21.1890 44.9794 21.9104 4.4750 8.2728 261.7239 123.9121 44.2946 12.7808 45.4123 9.6791 18.9691 23.9128 3.4699 0.2968 370.3150 96.2963 38.8922 93.1103 69.5764 39.8103 135.0935 3.7311 64.7824 3.6313 34.8916 42.0490 29.4650 35.0036 30.7703 32.3324 14.7224 7.3623 6.2465 4.0117 0.9053 3.8697
temp: 298.150 k
press: 1.00000 atm
elementType: 8 8 8 8 8 8 7 6 6 6 6 6 6 6 6 6 6 6 6 6 6 6 6 6 6 6 6 6 1 1 1 1 1 1 1 1 1 1 1 1 1 1 1 1 1 1 1 1 1
symmnumber: 1
zpe: 1001709.8 jmol-1
zpe.correction: 0.381531 hartree
zpe.thermalcorrener: 0.406902 hartree
zpe.thermalcorrenthalpy: 0.407846 hartree
zpe.thermalcorrgfe: 0.325383 hartree
zpe.sumelectzpe: -1316.825071 hartree
zpe.sumelectthermal: -1316.799701 hartree
zpe.sumelectthermalent: -1316.798756 hartree
zpe.sumelectthermalfe: -1316.881219 hartree
dipole: -0.2212 3.6037 0.0675
dipole: 3.6111
quadrupole: -153.0241 -154.7371 -158.0667
quadrupole: -4.4586 5.9640 2.1609
quadrupole: 2.2519 0.5389 -2.7908 -4.4586 5.9640 2.1609
hfenergy: -1317.2066022 hartree
pointgroup: C01 [X(C21H21N1O6)]
dipole: -0.1145609 -1.4158125 -0.0276012 debye
polarizability: 350.4976354|-9.942743|283.7054519|-24.9599423|-8.8791116|150.6966051 unknown
InChI: InChI=1S/C21H21NO6/c1-22-7-6-11-8-15-16(27-10-26-15)9-13(11)18(22)19-12-4-5-14(24-2)20(25-3)17(12)21(23)28-19/h4-5,8-9,18-19H,6-7,10H2,1-3H3
charge 0 multiplicity 1
49 atoms
O  0.259657 1.043401 0.648377
O  -4.173806 2.573032 -0.869403
O  -5.925912 1.235434 0.075022
O  4.725467 1.630282 -0.13351
O  1.644522 2.841993 0.1801
O  5.928698 -0.88726 -0.472141
N  -0.590609 -2.546557 -0.185289
C  -0.675666 -1.068906 -0.314344
C  0.34649 -0.446123 0.701071
C  -2.104844 -0.510441 -0.162124
C  -1.400086 -3.059588 0.948764
C  -3.151228 -1.311949 0.379187
C  -2.907911 -2.761244 0.788924
C  1.806252 -0.732704 0.400084
C  -2.370379 0.821199 -0.605497
C  -0.81509 -3.26459 -1.459913
C  2.509277 0.494072 0.243133
C  -4.473327 -0.786841 0.504606
C  -3.666351 1.306679 -0.468367
C  1.533263 1.610541 0.344732
C  -4.700712 0.519493 0.081323
C  2.456399 -1.96888 0.265066
C  3.907334 0.506766 -0.030094
C  3.827899 -1.962541 -0.075272
C  4.552032 -0.75792 -0.232779
C  -5.54901 2.622944 -0.314192
C  4.555965 2.75275 0.821722
C  6.50431 -0.136505 -1.610686
H  -0.30114 -0.800676 -1.321341
H  0.065165 -0.733988 1.73099
H  -1.029981 -2.594007 1.881914
H  -1.224986 -4.14746 1.038226
H  -3.438465 -2.986532 1.734171
H  -3.340674 -3.435658 0.021484
H  -1.574128 1.446786 -1.013904
H  -0.704578 -4.350539 -1.287584
H  -0.047343 -2.957281 -2.192139
H  -1.816269 -3.086191 -1.916371
H  -5.281852 -1.397873 0.916864
H  1.895368 -2.898139 0.381908
H  4.383425 -2.896402 -0.207423
H  -6.24001 2.974861 -1.09492
H  -5.552512 3.261135 0.590249
H  3.674811 3.35625 0.556111
H  5.485641 3.334107 0.728116
H  4.456753 2.359965 1.850591
H  6.37164 0.948312 -1.474405
H  6.033182 -0.4633 -2.557834
H  7.571818 -0.40361 -1.612304
