program: Gaussian 09
title: 000170457
version: EM64L-G09RevD.01
frameworkgroup: C1[X(C17H14O2)]
method: RPBEPBE
basis: SDD
operation: Freq
keyword: #pfreq=noraman
keyword: PBEPBE/SDD
title: #p freq=noraman PBEPBE/SDD
converged: NO YES NO NO
title: Mulliken charges:
elementType: O O C C C C C C C C C C C C C C C C C H H H H H H H H H H H H H H
charge: -0.412526 -0.231685 0.221601 0.198232 0.198965 -0.607412 0.461518 0.461771 -0.803684 -0.500836 -0.386216 -0.386620 -0.458519 -0.458329 -0.266374 -0.265766 -0.246459 -0.246504 0.182338 0.248360 0.247279 0.245416 0.277396 0.276984 0.235050 0.234092 0.244774 0.244717 0.227662 0.227608 0.230163 0.230141 0.376863
chargesum: 0.00000
title: Mulliken charges with hydrogens summed into heavy atoms:
elementType: O O C C C C C C C C C C C C C C C C C
charge: -0.035663 -0.231685 0.221601 0.198232 0.198965 -0.111773 0.461518 0.461771 -0.558268 0.053544 -0.151166 -0.152528 -0.213745 -0.213612 -0.038713 -0.038158 -0.016296 -0.016363 0.182338
polarizability: 2.15463018e+02 1.72969529e+00 2.97989926e+02 -1.95576108e+01 2.48729439e-01 9.88972832e+01
1716.lowfreq: -10.4303 0.0007 0.0008 0.0009 7.6348 11.0045 11.3670 28.2710 54.4398
frequency: 10.9233 28.1888 54.4137 87.4262 94.4455 116.7456 163.4267 177.0955 237.1789 263.8113 312.1682 355.6847 384.4205 396.7851 412.6777 440.7204 477.4892 502.8850 504.8983 532.5635 548.2306 565.4103 601.0671 602.9477 637.3732 640.0965 647.0956 692.0286 746.5331 756.9856 765.0207 767.6557 814.8515 834.6227 850.7690 858.5603 869.3565 885.1278 902.3450 932.2997 962.5864 970.6962 989.3160 991.1073 1010.1489 1014.0896 1024.9796 1050.7033 1055.2391 1078.6170 1105.5549 1159.4029 1164.9570 1172.7649 1185.3069 1204.0784 1242.2480 1248.5673 1271.4219 1274.4530 1292.9285 1302.5053 1350.1149 1369.7581 1371.2380 1388.3455 1415.2992 1439.3747 1442.3153 1445.2238 1450.4824 1483.9603 1517.3126 1537.6974 1567.7774 1583.3898 1629.7685 1632.7036 1663.5386 3001.5027 3038.8724 3047.8935 3087.2925 3118.4124 3121.4193 3122.4344 3132.6733 3133.0352 3150.2727 3150.7503 3164.5913 3165.4036 3510.8825
redmass: 12.6026 6.1237 4.6663 4.8561 2.4111 3.4970 6.6971 5.2262 4.6696 4.7120 4.1923 2.6140 5.1796 4.7861 4.6114 3.6527 2.7257 3.4564 1.8661 4.9102 4.1409 3.1023 4.3332 6.3948 5.3906 1.3267 4.8222 5.3181 1.2626 3.3329 1.5016 1.3731 2.0098 2.8538 4.0860 1.8428 1.6033 3.3283 4.5279 2.0633 1.3627 1.4579 1.3328 1.3813 4.3579 2.4718 2.4499 1.9971 3.8659 2.4735 2.2856 1.2485 1.3074 1.1155 1.1381 1.2625 1.4432 1.5747 1.9862 1.1675 1.9317 1.5784 4.9227 1.8744 2.1981 1.9309 4.2874 4.6005 1.2475 2.6280 2.3024 2.1590 1.2477 6.2301 7.6354 5.3951 6.4562 6.0634 8.1359 1.0611 1.0610 1.0983 1.1013 1.0907 1.0862 1.0867 1.0879 1.0880 1.0942 1.0943 1.1000 1.1000 1.0639
irintensity: 0.9782 0.0319 0.1967 0.9565 0.3581 0.0363 4.5724 0.5407 0.0021 0.1712 0.0896 0.2011 0.0522 1.9985 0.0165 36.9501 0.0049 0.0196 23.5971 38.3355 2.8853 10.2978 2.3594 5.3490 1.6313 115.6969 5.0693 3.2935 117.1585 0.0974 9.4519 0.7434 12.8809 1.8296 1.7717 23.6128 0.0666 15.8104 0.0410 14.6032 0.0056 14.9306 0.0026 1.3977 142.4320 7.6214 0.3417 5.0913 55.4226 112.8807 0.3847 0.1730 10.3172 0.4232 0.2361 3.7879 0.8574 3.2556 1.0948 0.0912 5.8036 34.7381 44.0731 41.3060 0.3487 1.1261 6.6048 3.5488 27.0211 5.1120 8.7860 3.5482 19.9462 5.9903 0.7694 2.1249 0.0093 4.8177 221.9470 8.6733 16.6255 0.7897 10.7379 2.8386 0.0815 9.0084 1.5809 9.3254 7.9892 60.0957 75.8645 1.5146 19.5663
temp: 298.150 k
press: 1.00000 atm
elementType: 8 8 6 6 6 6 6 6 6 6 6 6 6 6 6 6 6 6 6 1 1 1 1 1 1 1 1 1 1 1 1 1 1
symmnumber: 1
zpe: 684728.9 jmol-1
zpe.correction: 0.260799 hartree
zpe.thermalcorrener: 0.276220 hartree
zpe.thermalcorrenthalpy: 0.277164 hartree
zpe.thermalcorrgfe: 0.215585 hartree
zpe.sumelectzpe: -805.370940 hartree
zpe.sumelectthermal: -805.355519 hartree
zpe.sumelectthermalent: -805.354575 hartree
zpe.sumelectthermalfe: -805.416154 hartree
dipole: -0.6048 -0.0023 1.4356
dipole: 1.5578
quadrupole: -98.0777 -96.1906 -120.2776
quadrupole: -0.0319 3.0058 0.0541
quadrupole: 6.7710 8.6580 -15.4289 -0.0319 3.0058 0.0541
hfenergy: -805.6317392 hartree
pointgroup: C01 [X(C17H14O2)]
dipole: -0.2384977 0.0007371 0.5645591 debye
polarizability: 215.5463998|2.6067713|297.9438319|-19.4336692|0.7372104|98.859996 unknown
InChI: InChI=1S/C17H14O2/c18-17(19)10-9-16-14-7-3-1-5-12(14)11-13-6-2-4-8-15(13)16/h1-8,11,18H,9-10H2
charge 0 multiplicity 1
33 atoms
O  4.790483 -0.125842 1.369665
O  4.551157 -0.090621 -0.939245
C  0.17701 -0.012896 -0.413004
C  -0.482744 1.244951 -0.226727
C  -0.553118 -1.231593 -0.229916
C  1.659706 -0.05295 -0.761591
C  -1.900412 1.278686 0.128128
C  -1.970806 -1.184519 0.124147
C  -2.607795 0.0660 0.288901
C  2.541345 -0.065383 0.512357
C  0.196568 2.513758 -0.362106
C  0.052357 -2.536966 -0.367882
C  -2.557021 2.548454 0.314367
C  -2.699418 -2.415103 0.305799
C  -0.467902 3.721343 -0.170188
C  -0.680638 -3.704901 -0.17991
C  -1.863683 3.743808 0.170924
C  -2.075911 -3.647884 0.159464
C  4.0227 -0.094242 0.194778
H  1.945935 0.809422 -1.385641
H  1.902476 -0.937485 -1.372716
H  -3.671826 0.09574 0.555772
H  2.339446 0.822271 1.14203
H  2.305687 -0.938171 1.15067
H  1.25869 2.533038 -0.6247
H  1.112054 -2.616064 -0.628871
H  -3.622088 2.549607 0.575807
H  -3.763119 -2.356124 0.56612
H  0.07412 4.667037 -0.281092
H  -0.193689 -4.679871 -0.292902
H  -2.371242 4.70352 0.316059
H  -2.638098 -4.5772 0.300924
H  5.756676 -0.142118 1.128076
