program: Gaussian 09
title: 000170490
version: EM64L-G09RevD.01
frameworkgroup: C1[X(C22H17ClN2O4)]
method: RPBEPBE
basis: SDD
operation: Freq
keyword: #p
keyword: freq=noraman
keyword: PBEPBE/SDD
title: #p freq=noraman PBEPBE/SDD
converged: YES YES NO NO
title: Mulliken charges:
elementType: Cl O O O O N N C C C C C C C C C C C C C C C C C C C C C C H H H H H H H H H H H H H H H H H
charge: -0.008188 -0.292977 -0.304725 -0.309070 -0.262504 -0.639368 -0.672120 0.244904 0.200300 0.280317 0.282482 0.035280 -0.174031 -0.165211 0.462157 0.320646 -0.700514 -0.389503 -0.387641 -0.230298 -0.229644 -0.297472 -0.273548 0.366441 -0.348443 -0.373730 -0.224459 -0.195519 -0.254999 0.291711 0.292322 0.235607 0.235636 0.327111 0.387167 0.210338 0.246852 0.392923 0.316435 0.208764 0.217503 0.243112 0.252890 0.224349 0.229253 0.229468
chargesum: 0.00000
title: Mulliken charges with hydrogens summed into heavy atoms:
elementType: Cl O O O O N N C C C C C C C C C C C C C C C C C C C C C C
charge: -0.008188 -0.292977 -0.304725 -0.309070 -0.262504 0.074910 0.037238 0.244904 0.200300 0.280317 0.282482 0.035280 -0.174031 -0.165211 0.462157 0.320646 -0.700514 -0.097792 -0.095320 0.005310 0.005992 0.159718 0.152718 0.366441 -0.105331 -0.120840 -0.000110 0.033734 -0.025531
polarizability: 5.15303892e+02 -2.22742833e+01 3.06516767e+02 1.41992606e+00 -1.37169061e+01 1.38487474e+02
1716.lowfreq: -0.0006 0.0001 0.0009 1.2732 4.5956 8.4765 12.1564 17.3269 27.4757
frequency: 9.9922 17.2360 27.4395 37.8730 51.8193 73.8835 90.0092 108.0771 114.6973 134.0856 155.6886 160.7507 177.1331 203.2790 227.7472 232.8890 240.5261 244.0610 278.5518 305.7841 340.7478 342.8430 354.3220 368.5732 394.5321 408.6771 411.5243 424.4858 427.2499 430.8943 449.0856 454.8053 487.0816 502.4570 520.0357 531.1588 540.6175 559.8243 591.4547 592.5030 610.1697 623.4705 659.4933 665.4764 680.8435 691.9835 695.9371 724.2094 736.9031 757.7289 762.3069 775.1164 807.7495 819.5623 829.8536 834.7747 855.8522 860.5881 864.9502 890.0637 894.7818 905.0797 932.9138 960.7159 975.7455 982.9991 983.6440 997.1008 1007.1627 1013.2949 1018.9348 1023.5111 1032.1101 1045.0628 1085.4021 1087.9317 1105.4090 1122.7853 1140.8085 1161.5053 1168.1321 1170.8787 1182.4719 1194.1520 1203.9002 1218.8517 1257.2666 1259.3578 1296.9905 1316.5880 1340.9758 1349.6561 1364.6444 1377.4981 1382.4120 1391.2664 1397.8297 1406.5984 1434.7589 1443.9979 1450.3912 1455.5961 1459.7618 1466.6132 1481.8417 1488.4893 1518.5348 1533.7426 1545.7998 1567.8316 1592.8381 1593.0409 1609.5964 1612.6909 1624.2472 2953.4406 2996.9882 3016.4792 3083.9442 3129.2521 3133.2260 3138.1716 3150.7287 3154.8478 3163.6066 3164.6108 3172.1174 3173.8669 3196.9968 3258.6632 3604.9122 3610.6627
redmass: 6.1448 6.2218 4.4005 6.0985 9.8516 5.4504 6.2149 4.9804 7.2647 5.0977 5.2890 6.9516 8.0813 4.6777 6.5127 5.4516 2.9807 3.8324 12.4187 5.8442 5.3308 6.5681 4.8658 4.7558 6.6493 4.0426 3.0379 5.4848 3.7172 6.1238 9.3266 4.7953 7.9614 2.8723 5.5308 6.1006 1.2424 6.5446 1.7552 2.0949 6.4188 5.3589 6.6203 6.1184 5.0679 2.2303 4.3605 5.7327 2.5648 1.7387 3.6619 7.4532 1.8784 1.4125 1.1523 2.8043 1.1080 2.9429 6.7451 1.4859 6.4402 3.2468 1.9085 1.3666 4.3658 4.6715 1.3862 1.3870 3.5198 1.3563 2.7842 2.2005 2.0932 2.4497 1.5377 2.3424 2.2489 2.9475 2.1282 2.0289 1.0813 1.1209 1.1670 2.5986 1.1117 3.6212 1.6082 1.1875 4.1908 1.3272 3.0646 3.5465 1.5630 5.6982 2.9377 3.1190 2.4427 6.4651 3.2577 2.2769 2.9345 1.1403 1.1407 2.6586 2.0559 5.9861 6.0974 4.7383 2.4312 1.8028 3.7964 6.2032 6.5079 6.2926 8.1882 1.0563 1.0635 1.1030 1.1026 1.0848 1.0862 1.0888 1.0907 1.0924 1.0959 1.0943 1.0994 1.1006 1.0655 1.0618 1.0873 1.0894
irintensity: 0.1552 0.1554 0.7006 0.7546 1.3399 3.8062 2.6955 1.9365 2.2394 2.2514 1.0750 0.5533 0.6734 2.9031 3.2612 0.5771 5.2441 1.1183 0.4896 3.6194 3.1971 0.5525 2.7305 2.2355 0.5674 0.7178 0.1836 39.6842 5.6824 0.2180 15.1831 4.4027 11.6429 11.5704 1.0825 9.4039 109.3227 3.9981 101.6168 62.4408 0.9536 38.7072 3.5876 3.8489 1.0306 32.4174 9.7683 3.9668 22.2562 82.4587 16.5502 8.8782 54.0639 11.4059 80.6700 39.0747 145.4398 2.7232 22.0024 8.9449 18.1949 112.7679 0.0184 0.1984 35.3176 0.3408 0.7291 5.6291 34.8788 0.0197 3.9877 18.6824 29.0944 20.2298 17.6088 13.8415 7.9969 227.9263 1.5293 206.4858 4.5290 10.9353 39.4055 111.9500 49.7008 252.7000 8.1479 5.8088 367.2580 2.1014 384.8419 67.7531 5.3588 2.0465 26.2095 118.2579 26.6572 2.2793 158.0699 4.0871 2.3196 31.8918 67.7587 6.0657 78.2438 41.5189 334.3679 128.1203 98.5085 219.1066 49.0349 35.4984 0.5187 85.6422 25.4366 32.3953 34.5200 45.6508 21.4555 4.8998 4.8987 10.1217 15.7598 38.3254 19.0356 1.9842 35.7486 6.9930 43.1892 55.0154 94.0349 143.1147
temp: 298.150 k
press: 1.00000 atm
elementType: 17 8 8 8 8 7 7 6 6 6 6 6 6 6 6 6 6 6 6 6 6 6 6 6 6 6 6 6 6 1 1 1 1 1 1 1 1 1 1 1 1 1 1 1 1 1
symmnumber: 1
zpe: 902642.8 jmol-1
zpe.correction: 0.343798 hartree
zpe.thermalcorrener: 0.368177 hartree
zpe.thermalcorrenthalpy: 0.369122 hartree
zpe.thermalcorrgfe: 0.287112 hartree
zpe.sumelectzpe: -1717.006398 hartree
zpe.sumelectthermal: -1716.982019 hartree
zpe.sumelectthermalent: -1716.981075 hartree
zpe.sumelectthermalfe: -1717.063084 hartree
dipole: -2.6825 -0.6098 2.3485
dipole: 3.6171
quadrupole: -157.0497 -167.4578 -173.3127
quadrupole: 2.5135 -5.0991 -3.9928
quadrupole: 8.8904 -1.5178 -7.3726 2.5135 -5.0991 -3.9928
hfenergy: -1717.3501962 hartree
pointgroup: C01 [X(C22H17Cl1N2O4)]
dipole: 1.0633057 0.2916647 0.8996962 debye
polarizability: 515.508239|-21.0412349|307.2086444|-4.3550357|5.540262|137.5912493 unknown
InChI: InChI=1S/C22H17ClN2O4/c23-17-18(24)15-16(21(27)14-9-5-4-8-13(14)20(15)26)19(25)22(17)29-11-10-28-12-6-2-1-3-7-12/h1-9H,10-11,24-25H2
charge 0 multiplicity 1
46 atoms
Cl 1.111482 -2.975413 0.237692
O  1.639527 0.113766 0.160888
O  -2.702356 2.757424 -0.18909
O  -4.329897 -2.536823 0.103152
O  4.588939 -0.315364 0.270143
N  -0.212986 2.042928 -0.042997
N  -1.880151 -3.325382 0.22546
C  -2.069569 0.426309 0.001689
C  -2.490072 -0.955107 0.080068
C  -4.493235 1.151289 -0.143811
C  -4.907677 -0.209629 -0.065442
C  -0.675927 0.755452 0.034945
C  -3.053198 1.51021 -0.113898
C  -3.913599 -1.307588 0.044954
C  -1.511371 -2.007179 0.172174
C  0.302127 -0.307757 0.165975
C  -0.120008 -1.632969 0.201359
C  -5.466976 2.177735 -0.252088
C  -6.290835 -0.524926 -0.096741
C  -6.836283 1.855998 -0.282243
C  -7.249611 0.499103 -0.204037
C  2.457509 -0.157501 1.379204
C  3.803268 0.516408 1.183935
C  5.872046 0.141919 -0.087082
C  6.467494 1.326561 0.412872
C  6.56983 -0.680551 -1.005886
C  7.769196 1.678376 -0.017082
C  7.864812 -0.31593 -1.422303
C  8.473776 0.865993 -0.931102
H  -5.117043 3.212727 -0.311633
H  -6.578699 -1.578728 -0.035967
H  -7.58475 2.651346 -0.366766
H  -8.316237 0.250684 -0.227984
H  0.792907 2.196605 -0.093497
H  -0.937127 2.777181 -0.139733
H  1.935205 0.273903 2.255649
H  2.589811 -1.244368 1.514526
H  -2.904344 -3.500554 0.197101
H  -1.172365 -4.056168 0.27487
H  4.317283 0.592941 2.165733
H  3.66891 1.535838 0.768037
H  5.943667 1.973365 1.123249
H  6.080746 -1.586692 -1.376244
H  8.229305 2.59506 0.368941
H  8.400161 -0.954525 -2.133636
H  9.480314 1.146333 -1.258253
