program: Gaussian 09
title: 000170444
version: EM64L-G09RevD.01
frameworkgroup: C1[X(C18H16O)]
method: RPBEPBE
basis: SDD
operation: Freq
keyword: #pfreq=noraman
keyword: PBEPBE/SDD
title: #p freq=noraman PBEPBE/SDD
converged: YES YES NO YES
title: Mulliken charges:
elementType: O C C C C C C C C C C C C C C C C C C H H H H H H H H H H H H H H H H
charge: -0.444603 0.049458 -0.290711 0.402478 -0.519860 -0.485792 0.227089 0.122521 -0.692588 0.388062 0.183309 -0.444702 0.421633 -0.513913 -0.897115 -0.347759 -0.454770 -0.281329 -0.254486 0.211264 0.222214 0.242674 0.220296 0.221208 0.245442 0.241606 0.235741 0.225433 0.246145 0.244613 0.335685 0.245522 0.240773 0.225171 0.229289
chargesum: 0.00000
title: Mulliken charges with hydrogens summed into heavy atoms:
elementType: O C C C C C C C C C C C C C C C C C C
charge: -0.108917 0.049458 -0.079447 0.402478 -0.054972 -0.044288 0.227089 0.122521 -0.447146 0.388062 0.183309 -0.203095 0.421633 -0.278172 -0.180924 -0.102237 -0.213997 -0.056158 -0.025197
polarizability: 3.27915004e+02 -1.93270772e+00 2.08049416e+02 4.35639915e+00 -5.79954827e+00 9.62300826e+01
1716.lowfreq: -6.4931 -4.1976 -2.4161 -0.0007 0.0002 0.0004 30.6978 60.6723 71.4608
frequency: 30.6776 60.6642 71.4464 125.4327 138.4641 179.4658 215.1110 246.5626 265.2085 272.4844 291.5304 316.9882 335.6616 347.3732 400.8309 412.7858 435.1629 463.1398 485.9644 499.6576 533.3053 547.3327 570.5826 604.7091 617.4147 640.5567 676.6488 717.5914 742.2626 756.3957 762.2505 789.3853 815.4786 827.1268 844.6578 859.3228 882.9737 890.9372 897.4874 948.8607 954.1313 971.0798 980.4640 981.4639 990.5600 1025.4297 1028.7465 1041.4192 1044.8734 1050.3377 1092.2272 1140.3371 1151.0366 1159.3967 1172.7750 1179.7502 1185.7591 1228.3827 1233.7523 1251.9655 1271.3530 1277.4033 1297.1350 1303.8772 1312.7250 1350.9895 1367.2098 1390.1929 1396.1981 1401.9039 1415.2863 1433.3203 1448.9488 1458.9277 1462.7716 1486.1569 1495.3211 1503.8342 1540.2900 1591.7023 1602.3719 1620.7071 1634.6798 2967.2662 2969.5690 2985.0173 3004.6830 3039.7006 3052.1496 3069.8847 3078.2662 3119.4802 3124.1482 3128.4222 3133.1083 3153.3300 3158.0923 3245.3840 3538.7330
redmass: 3.6149 4.3706 3.5034 4.6871 2.3975 4.1679 3.6540 4.3025 1.1835 2.8967 5.0251 2.8316 1.4636 2.4653 3.2282 2.8139 4.8999 4.4246 4.0371 3.5555 3.6708 6.4712 3.6774 4.2936 3.9142 3.2159 5.2398 2.8542 2.9271 2.4172 1.7213 3.0935 2.0111 3.9731 2.1947 4.5332 1.7274 1.5834 2.0840 3.0667 1.3918 4.6840 1.7359 1.8065 1.3723 2.3733 1.9545 1.9978 1.6046 2.2742 3.0284 1.7063 1.2494 1.4503 1.2279 1.1207 1.2290 1.5479 2.0543 1.3548 1.7264 1.6742 2.0572 2.1463 1.4243 2.0253 4.3430 4.0776 4.5103 1.2746 2.1721 3.2247 1.2216 1.9370 1.1507 1.0579 1.1202 3.6665 4.3987 8.3878 6.4927 6.4182 7.1276 1.0835 1.0396 1.0604 1.0662 1.0987 1.0952 1.1032 1.0987 1.0868 1.0865 1.0914 1.0907 1.0974 1.0993 1.0895 1.0661
irintensity: 0.1058 0.4425 1.2663 2.9814 2.5541 2.9232 2.8442 3.5040 118.4384 14.4194 1.8698 1.7688 2.7612 2.8128 0.3159 2.8642 7.7296 2.6738 0.9796 3.0589 1.2953 0.2045 2.0948 6.5457 4.6936 3.0206 6.9965 16.9979 0.8461 20.0457 43.3881 2.0554 6.8816 7.9457 42.5454 8.9000 3.6726 42.0947 14.8934 24.4319 0.7086 17.2426 2.7421 4.5972 2.1561 7.4605 19.7620 8.7522 5.4719 3.5980 5.2798 2.2529 23.4944 8.7986 23.2452 2.4614 5.5915 2.4907 2.8629 3.6190 7.2207 1.1295 5.0657 2.7537 1.5659 9.1216 2.6404 11.1749 13.3218 13.9215 5.4202 11.4872 2.9392 15.4911 5.5438 13.6272 22.7212 0.9197 5.3156 5.1357 2.6106 0.4546 0.5498 49.6411 37.1719 24.9944 66.2683 23.5092 19.2877 43.8870 23.0516 1.6145 4.6870 15.8420 19.6594 26.1964 42.5577 8.9255 6.8616
temp: 298.150 k
press: 1.00000 atm
elementType: 8 6 6 6 6 6 6 6 6 6 6 6 6 6 6 6 6 6 6 1 1 1 1 1 1 1 1 1 1 1 1 1 1 1 1
symmnumber: 1
zpe: 748948.0 jmol-1
zpe.correction: 0.285259 hartree
zpe.thermalcorrener: 0.300430 hartree
zpe.thermalcorrenthalpy: 0.301374 hartree
zpe.thermalcorrgfe: 0.243043 hartree
zpe.sumelectzpe: -769.438064 hartree
zpe.sumelectthermal: -769.422893 hartree
zpe.sumelectthermalent: -769.421948 hartree
zpe.sumelectthermalfe: -769.480280 hartree
dipole: -1.3197 -0.4120 -1.4041
dipole: 1.9705
quadrupole: -87.8997 -98.7918 -118.6787
quadrupole: 2.4176 4.9586 -2.6771
quadrupole: 13.8904 2.9983 -16.8886 2.4176 4.9586 -2.6771
hfenergy: -769.7233229 hartree
pointgroup: C01 [X(C18H16O1)]
dipole: -0.5168549 0.1704794 0.5520946 debye
polarizability: 327.9472515|0.1560918|208.0027117|-4.4075234|-5.8861774|96.2445388 unknown
InChI: InChI=1S/C18H16O/c1-11-10-16-14(8-9-17(16)19)15-7-6-12-4-2-3-5-13(12)18(11)15/h2-7,10,17,19H,8-9H2,1H3
charge 0 multiplicity 1
35 atoms
O  -4.499823 -0.69828 -1.103828
C  -1.835345 0.704615 0.142655
C  -3.984352 -0.370858 0.252456
C  -2.478698 -0.535339 0.205966
C  -2.852301 1.839704 0.147923
C  -4.157952 1.132662 0.623271
C  -0.415964 0.779236 0.04177
C  0.388169 -0.435887 0.056358
C  -1.725012 -1.725514 0.140872
C  -0.314735 -1.708883 0.066914
C  1.858649 -0.272212 0.033433
C  0.203327 2.076622 -0.102591
C  2.425332 1.052842 -0.140406
C  1.568205 2.209581 -0.222121
C  0.338515 -3.08045 -0.054146
C  2.803236 -1.3378 0.209732
C  3.840895 1.240618 -0.198383
C  4.190187 -1.13065 0.165113
C  4.72445 0.166478 -0.058373
H  -4.473274 -1.037384 0.993515
H  -2.571318 2.677484 0.812092
H  -2.969726 2.254146 -0.872765
H  -4.244636 1.221901 1.722857
H  -5.069113 1.56665 0.174009
H  -2.243986 -2.690781 0.126347
H  -0.443393 2.959594 -0.135091
H  2.029802 3.194978 -0.355724
H  0.861942 -3.389305 0.871146
H  -0.437422 -3.840071 -0.249381
H  1.063247 -3.128347 -0.88638
H  -5.49076 -0.653271 -1.078507
H  2.460264 -2.347944 0.413476
H  4.224337 2.257909 -0.342793
H  4.864541 -1.981992 0.310989
H  5.807712 0.322051 -0.102405
