program: Gaussian 09
title: 000170361
version: EM64L-G09RevD.01
frameworkgroup: C1[X(C13H13N3)]
method: RPBEPBE
basis: SDD
operation: Freq
keyword: #pfreq=noraman
keyword: PBEPBE/SDD
title: #p freq=noraman PBEPBE/SDD
converged: NO NO NO NO
title: Mulliken charges:
elementType: N N N C C C C C C C C C C C C C H H H H H H H H H H H H H
charge: -0.251315 -0.005863 -0.005861 -0.312045 -0.312044 -0.504867 0.403998 0.403993 -0.468992 -0.468991 -0.600893 -0.600892 0.063678 0.063688 -0.290214 -0.290214 0.247819 0.247822 0.212340 0.250711 0.229672 0.224694 0.224693 0.229673 0.276998 0.275694 0.275693 0.240514 0.240513
chargesum: 0.00000
title: Mulliken charges with hydrogens summed into heavy atoms:
elementType: N N N C C C C C C C C C C C C C
charge: 0.025683 -0.005863 -0.005861 -0.064226 -0.064223 -0.041816 0.403998 0.403993 -0.014626 -0.014626 -0.325200 -0.325199 0.063678 0.063688 -0.049700 -0.049701
polarizability: 2.44766835e+02 5.56899913e-05 1.43927695e+02 1.28823565e+01 -1.81843703e-05 9.16183075e+01
1716.lowfreq: -21.8269 -9.8474 -0.0002 0.0004 0.0005 6.0431 68.5293 87.0330 173.0419
frequency: 68.4751 86.8797 173.0402 199.6213 218.5993 262.0415 309.4918 343.7882 377.4525 407.9671 437.9044 456.6842 480.2611 494.6551 572.8721 586.0329 590.7932 601.6877 616.3092 712.3166 717.0045 767.3880 770.7165 804.8537 806.2821 837.2253 848.7005 856.0356 904.8002 911.2440 914.8896 919.5571 923.1718 936.8176 949.8715 1014.9571 1025.8226 1033.5759 1042.7919 1076.5987 1087.0177 1120.0361 1141.0297 1160.1622 1184.3068 1217.7993 1221.3141 1230.6602 1232.9665 1258.7004 1263.8620 1296.6235 1305.1708 1317.3817 1332.6223 1345.6405 1351.5561 1355.6918 1438.6645 1444.0339 1450.9341 1454.5903 1458.0759 1460.9066 1487.3584 1514.2520 1560.6842 1640.9553 2973.9631 2976.3388 3002.1110 3039.3240 3043.6128 3054.2221 3055.3504 3068.4129 3122.0048 3146.6382 3148.0541 3150.8803 3449.6014
redmass: 4.7782 5.1880 5.0293 2.7772 4.4821 2.1511 3.4909 3.5002 3.9850 3.7858 3.5330 4.6561 2.7409 5.2009 3.4885 8.2267 3.4616 5.8019 1.4764 6.2025 6.0249 3.9296 4.2941 3.3214 3.8280 2.8743 1.4396 1.6865 1.8766 1.6502 4.4107 2.0181 1.7028 2.7570 1.4873 1.8776 2.6669 1.8610 2.3243 2.4674 1.7681 1.4380 1.5427 1.6228 2.4123 1.3801 1.8843 1.4110 2.9786 1.6962 1.4638 2.2121 1.3092 1.6032 1.6972 1.5336 1.3369 2.8053 2.9548 3.3528 1.1097 1.1845 3.2709 1.1595 1.1356 7.1143 8.2450 8.1076 1.0627 1.0644 1.0603 1.0871 1.0902 1.1003 1.1004 1.1051 1.0880 1.0976 1.0928 1.0929 1.0750
irintensity: 0.3894 0.0061 4.2823 0.0036 0.3126 5.9467 2.1721 5.1099 6.4007 2.5177 6.2709 0.0671 1.0182 1.9513 0.0034 6.5980 2.4091 0.1344 206.2685 0.3759 4.3608 8.1221 0.0675 16.5119 0.0002 0.6441 2.5730 28.4097 13.2867 0.0046 5.8789 4.4702 54.5834 1.4440 0.0001 0.0023 12.1556 1.2956 3.1129 6.4930 15.2021 2.2323 1.2801 10.9700 0.7341 4.1439 39.8826 0.2061 6.9343 3.2917 0.0604 1.0404 5.5449 1.7819 5.8283 3.1217 2.6690 14.4819 0.9507 1.3348 4.1481 5.9278 79.7648 9.9804 24.8698 0.3586 0.1679 1.0834 51.4253 84.6300 43.0793 50.2878 65.5950 26.4438 19.7683 31.8168 3.3842 56.3471 6.2742 0.2036 2.0450
temp: 298.150 k
press: 1.00000 atm
elementType: 7 7 7 6 6 6 6 6 6 6 6 6 6 6 6 6 1 1 1 1 1 1 1 1 1 1 1 1 1
symmnumber: 1
zpe: 619801.3 jmol-1
zpe.correction: 0.236070 hartree
zpe.thermalcorrener: 0.247419 hartree
zpe.thermalcorrenthalpy: 0.248363 hartree
zpe.thermalcorrgfe: 0.198982 hartree
zpe.sumelectzpe: -666.292825 hartree
zpe.sumelectthermal: -666.281476 hartree
zpe.sumelectthermalent: -666.280532 hartree
zpe.sumelectthermalfe: -666.329913 hartree
dipole: -1.1609 0.0000 -0.8081
dipole: 1.4145
quadrupole: -87.5423 -94.4820 -96.9140
quadrupole: 0.0001 7.1647 0.0000
quadrupole: 5.4371 -1.5026 -3.9345 0.0001 7.1647 0.0000
hfenergy: -666.5288952 hartree
pointgroup: C01 [X(C13H13N3)]
dipole: 0.4546387 -0.0000223 -0.320937 debye
polarizability: 244.590178|-0.0031094|143.927695|-13.891675|-0.0013165|91.7949644 unknown
InChI: InChI=1S/C13H13N3/c1-2-16-13-5-11-9-3-8(6-14-7-9)10(11)4-12(13)15-1/h1-2,4-5,8-9,14H,3,6-7H2
charge 0 multiplicity 1
29 atoms
N  2.797188 -0.000025 1.578163
N  -2.817758 -1.443397 0.114519
N  -2.817682 1.443567 0.114431
C  2.204822 -1.198779 -0.603211
C  2.204891 1.198644 -0.603281
C  2.814914 -0.000106 -1.39631
C  0.767365 -0.72369 -0.410638
C  0.767406 0.72364 -0.41068
C  2.941545 -1.251148 0.787845
C  2.941616 1.251042 0.787768
C  -0.405797 -1.443952 -0.226448
C  -0.405718 1.443977 -0.226526
C  -1.637541 -0.72931 -0.048829
C  -1.6375 0.729415 -0.048864
C  -3.945109 -0.716619 0.271556
C  -3.945073 0.716861 0.271488
H  2.291735 -2.1733 -1.11505
H  2.291853 2.173132 -1.115168
H  3.920777 -0.000139 -1.376633
H  2.477818 -0.000117 -2.448611
H  2.564094 -2.088286 1.40236
H  4.017546 -1.433745 0.594041
H  4.01763 1.433563 0.593952
H  2.564218 2.088233 1.402241
H  1.917285 0.000013 2.110866
H  -0.441544 -2.538239 -0.223016
H  -0.441408 2.538266 -0.223153
H  -4.880719 -1.272717 0.400952
H  -4.880656 1.273015 0.400837
