program: Gaussian 09
title: 000170384
version: EM64L-G09RevD.01
frameworkgroup: C1[X(C21H27NO2)]
method: RPBEPBE
basis: SDD
operation: Freq
keyword: #p
keyword: freq=noraman
keyword: PBEPBE/SDD
title: #p freq=noraman PBEPBE/SDD
converged: YES YES NO NO
title: Mulliken charges:
elementType: O O N C C C C C C C C C C C C C C C C C C C C C H H H H H H H H H H H H H H H H H H H H H H H H H H H
charge: -0.290841 -0.250705 -0.577865 0.195585 -0.123875 -0.526376 0.368195 0.360457 -0.106197 -0.444774 -0.714942 -0.394631 -0.320175 -0.357502 -0.432844 -0.692708 -0.257746 -0.258693 -0.276745 -0.258254 0.283814 -0.256595 -0.248453 -0.766304 0.309525 0.201615 0.224350 0.214179 0.227857 0.210731 0.205954 0.215744 0.210511 0.252167 0.262284 0.255607 0.234482 0.224332 0.207720 0.248797 0.282560 0.273538 0.222654 0.221872 0.227192 0.221300 0.225760 0.225845 0.245188 0.251608 0.244801
chargesum: 0.00000
title: Mulliken charges with hydrogens summed into heavy atoms:
elementType: O O N C C C C C C C C C C C C C C C C C C C C C
charge: -0.290841 -0.250705 -0.021767 0.195585 0.185649 -0.100412 0.368195 0.360457 0.107982 -0.006186 -0.082733 -0.142464 -0.057891 -0.101895 -0.198362 -0.011860 -0.035092 -0.036821 -0.049552 -0.036954 0.283814 -0.030835 -0.022607 -0.024706
polarizability: 2.51236560e+02 2.01958418e+01 2.16462211e+02 -6.27471074e+00 -6.17466692e+00 2.28629337e+02
1716.lowfreq: -8.8194 -0.0009 -0.0006 -0.0004 9.0473 11.4660 36.1530 43.4592 48.2071
frequency: 36.0441 43.3591 48.1032 61.0665 64.0297 66.1339 75.1939 80.1118 86.9765 93.0185 108.5104 114.6449 152.7046 192.2746 206.4601 220.2367 240.9339 243.1759 251.5964 256.3019 268.6772 273.4735 282.6589 291.0210 309.2378 329.6837 402.4498 402.9103 407.3692 422.9492 456.1832 471.5796 506.8425 526.4406 565.4853 576.9901 606.1081 616.4756 617.3787 619.2152 635.8316 645.9962 700.9632 704.2888 708.6739 757.8206 766.6737 779.8393 809.6489 839.3349 849.3941 852.2311 859.9883 880.6193 910.4316 921.2848 922.5538 934.3078 951.0182 976.8075 977.0275 986.9402 990.9911 991.9102 992.5585 995.4700 996.4825 1012.6618 1030.6620 1033.3317 1040.3810 1043.1900 1067.1829 1074.3934 1087.6724 1092.5281 1106.2032 1126.0928 1143.4105 1171.2696 1172.8627 1173.9605 1188.5592 1200.4058 1203.0589 1211.8045 1216.0214 1280.0774 1303.2446 1310.2695 1322.3338 1328.4263 1330.6924 1345.4328 1351.0557 1370.3633 1374.6584 1375.4627 1378.6610 1380.1646 1384.8231 1398.9198 1431.3686 1432.4598 1453.0677 1455.3575 1457.7934 1468.3602 1470.9074 1474.0975 1479.6084 1484.4654 1486.7344 1492.8851 1583.8840 1587.1309 1606.3449 1610.0353 1638.0016 1640.8342 2960.3509 2966.3489 2981.3915 2988.9715 2994.6444 3003.8320 3019.2940 3038.5559 3042.9553 3059.3980 3067.9487 3081.2058 3092.6332 3106.6674 3116.8889 3119.6137 3124.8573 3129.7037 3138.0825 3140.2199 3146.9289 3155.9639 3159.0616 3174.2908 3177.9554 3444.8148 3574.5537
redmass: 4.4764 5.8507 3.8621 3.2212 2.4260 3.1685 3.6544 3.3486 1.5596 2.7314 2.7947 3.6283 2.9152 3.5615 2.0406 3.3236 1.7143 1.4657 3.7397 3.9474 2.6123 2.0003 1.7817 2.7518 3.9750 2.7168 2.9188 2.7927 2.9067 2.4817 2.2988 2.6195 3.5001 3.2396 3.8779 4.0069 2.9972 3.8947 2.3104 5.2859 3.7800 4.1576 2.4089 1.9244 1.5994 2.1410 1.7871 2.4641 1.8289 2.5344 1.2647 1.3666 2.7534 2.6155 1.6624 3.1152 1.5497 1.6972 2.2410 1.4633 1.3939 2.3456 1.4715 3.7195 2.1122 1.7567 1.7726 1.9357 2.3256 2.3158 1.7207 2.6201 1.8494 2.1194 1.7874 2.0299 2.1796 1.7247 2.3455 1.3970 1.0530 1.6000 2.8730 1.3567 1.1541 2.6506 2.1815 1.2120 1.4209 1.2646 1.3996 1.4202 1.3171 1.4259 1.2974 3.2435 1.9664 2.1302 1.4397 1.2809 1.2072 1.2511 2.2580 2.2377 1.0659 1.0480 1.0931 1.0684 1.0496 1.0468 1.2570 1.9124 1.6275 1.0902 5.7756 5.8651 5.8801 5.9483 1.0955 8.7730 1.0357 1.0811 1.0628 1.0539 1.0453 1.0370 1.0838 1.0997 1.0983 1.0987 1.1002 1.0979 1.0970 1.0997 1.0847 1.0844 1.0879 1.0891 1.0936 1.1009 1.0931 1.0986 1.0982 1.0953 1.0952 1.0448 1.0978
irintensity: 0.1314 1.3744 0.1626 0.6368 3.0813 1.1589 0.4769 0.2321 0.2948 0.2190 0.4565 0.5836 1.9268 4.9535 1.6212 0.3208 0.9037 0.1904 3.0468 1.3391 10.7229 27.2989 33.6473 1.7978 1.2518 3.2674 2.0763 0.3922 1.1046 8.4991 2.6304 4.7974 5.7766 13.8742 9.6144 3.2712 43.3246 39.5045 113.1433 4.5786 10.5179 8.5756 27.6871 36.2139 49.8748 37.0036 21.2014 13.4775 6.4973 5.1689 0.2861 1.6364 1.4490 21.3031 14.0757 66.4518 1.3171 2.4737 3.8736 1.0398 1.2623 14.3903 0.2223 0.4690 1.5768 31.2621 41.6770 5.2532 16.2181 6.1842 10.5912 3.8865 8.7576 38.7964 7.1749 3.8043 3.6300 14.8424 13.6631 7.3094 0.0967 7.4267 43.0469 71.9970 6.3598 124.2752 113.6586 8.7114 0.3055 0.1822 6.0449 1.9346 3.0231 15.0759 7.2957 1.8835 5.5142 3.6210 17.8510 49.8637 8.6090 9.4366 11.7875 4.7325 21.9591 17.5040 7.0240 7.6920 15.9443 8.0298 11.9874 27.1472 6.0829 20.3117 1.8991 0.2904 9.8041 5.2084 39.4528 161.9782 34.9587 21.3976 29.6783 27.2635 33.7788 2.7251 2.3481 27.3874 12.5419 56.8399 47.3783 35.7739 7.9240 26.6263 2.7810 0.8178 3.4036 11.6258 28.7970 13.9241 35.8635 38.5455 31.8692 6.3851 5.1791 2.4919 0.5983
temp: 298.150 k
press: 1.00000 atm
elementType: 8 8 7 6 6 6 6 6 6 6 6 6 6 6 6 6 6 6 6 6 6 6 6 6 1 1 1 1 1 1 1 1 1 1 1 1 1 1 1 1 1 1 1 1 1 1 1 1 1 1 1
symmnumber: 1
zpe: 1129417.1 jmol-1
zpe.correction: 0.430172 hartree
zpe.thermalcorrener: 0.454914 hartree
zpe.thermalcorrenthalpy: 0.455858 hartree
zpe.thermalcorrgfe: 0.375823 hartree
zpe.sumelectzpe: -1019.831389 hartree
zpe.sumelectthermal: -1019.806647 hartree
zpe.sumelectthermalent: -1019.805703 hartree
zpe.sumelectthermalfe: -1019.885738 hartree
dipole: -0.5310 -1.8428 0.1675
dipole: 1.9251
quadrupole: -139.1391 -141.2883 -136.6949
quadrupole: -5.9224 -0.4460 -9.2306
quadrupole: -0.0984 -2.2475 2.3459 -5.9224 -0.4460 -9.2306
hfenergy: -1020.2615609 hartree
pointgroup: C01 [X(C21H27N1O2)]
dipole: 0.0498308 0.7498143 -0.0945612 debye
polarizability: 234.5134475|-27.1622837|233.4838766|4.0439939|-5.62588|228.3307843 unknown
InChI: InChI=1S/C21H27NO2/c1-4-20(24-17(3)23)21(15-16(2)22,18-11-7-5-8-12-18)19-13-9-6-10-14-19/h5-14,16,20H,4,15,22H2,1-3H3
charge 0 multiplicity 1
51 atoms
O  -0.866613 -1.845884 0.12604
O  0.143048 -3.777019 -0.717792
N  2.7958 -0.185828 -1.87699
C  0.053103 0.390314 -0.492876
C  -0.32765 -1.035593 -1.021755
C  0.683654 1.181351 -1.70349
C  1.112182 0.313372 0.654578
C  -1.181732 1.162223 0.070751
C  1.720321 0.488485 -2.631577
C  -1.345835 -1.146409 -2.185624
C  2.241635 1.532617 -3.660322
C  1.38378 1.494792 1.396222
C  -1.803824 0.683101 1.257822
C  1.850944 -0.85274 0.980902
C  -1.705022 2.348249 -0.506322
C  -2.835009 -0.899322 -1.853382
C  2.351921 1.517358 2.423747
C  -2.918637 1.336369 1.819771
C  2.8117 -0.839363 2.017423
C  -2.820695 3.012446 0.058299
C  -0.561952 -3.207614 0.148001
C  3.070084 0.34346 2.746461
C  -3.440354 2.507193 1.220647
C  -1.184633 -3.862983 1.362779
H  0.613356 -1.520524 -1.342116
H  -0.130225 1.508589 -2.376149
H  1.139152 2.105449 -1.293532
H  1.196389 -0.302103 -3.207032
H  -1.238145 -2.172231 -2.588711
H  -1.030546 -0.46582 -2.999102
H  1.416011 1.977579 -4.249308
H  2.944135 1.057086 -4.370256
H  2.778479 2.351921 -3.144672
H  0.815691 2.407356 1.179425
H  -1.404136 -0.21366 1.737355
H  1.720312 -1.773001 0.407079
H  -1.254151 2.78295 -1.402805
H  -3.156806 -1.52394 -1.00222
H  -3.458804 -1.164396 -2.72722
H  -3.040415 0.150978 -1.592092
H  3.209535 0.37854 -1.127954
H  3.508589 -0.619731 -2.473259
H  2.535836 2.446118 2.975993
H  -3.377906 0.935496 2.730838
H  3.365601 -1.757128 2.246854
H  -3.199092 3.926819 -0.41356
H  3.816098 0.350272 3.549267
H  -4.304832 3.019715 1.657606
H  -1.027733 -4.950457 1.320986
H  -0.721942 -3.459633 2.281383
H  -2.263563 -3.637521 1.410686
