program: Gaussian 09
title: 000170345
version: EM64L-G09RevD.01
frameworkgroup: C1[X(C11H15NO4)]
method: RPBEPBE
basis: SDD
operation: Freq
keyword: #p
keyword: freq=noraman
keyword: PBEPBE/SDD
title: #p freq=noraman PBEPBE/SDD
converged: YES YES NO NO
title: Mulliken charges:
elementType: O O O O N C C C C C C C C C C C H H H H H H H H H H H H H H H
charge: -0.279198 -0.253270 -0.414125 -0.406325 -0.620070 -0.596651 -0.179323 0.544478 0.302921 -0.556156 -0.445607 0.188827 -0.348192 0.148550 -0.224784 -0.673369 0.250841 0.196065 0.241161 0.271900 0.228340 0.292589 0.276196 0.215002 0.229019 0.230543 0.214049 0.227441 0.231627 0.356381 0.351140
chargesum: 0.00000
title: Mulliken charges with hydrogens summed into heavy atoms:
elementType: O O O O N C C C C C C C C C C C
charge: -0.279198 -0.253270 -0.057744 -0.055186 -0.051284 -0.149746 0.061838 0.544478 0.302921 -0.284256 -0.217267 0.188827 -0.133189 0.148550 0.234779 -0.000252
polarizability: 1.69645535e+02 1.13975045e+01 1.42415590e+02 -1.35404016e+01 1.31472377e+01 1.08117517e+02
1716.lowfreq: -10.9000 -1.1848 0.0003 0.0009 0.0009 8.4256 16.7820 29.6255 46.7880
frequency: 16.7112 29.5978 46.7787 70.5497 80.0707 107.4546 129.0388 148.0965 205.8167 237.1135 246.1737 256.8473 284.2112 295.1680 317.8897 324.3184 337.0261 341.7485 362.3715 381.3055 441.2928 447.4729 476.7082 529.9742 564.4491 583.1074 613.9996 628.7242 715.4463 728.4449 745.9378 771.1131 790.3483 798.3142 801.8427 851.7349 876.9136 904.9118 935.9642 954.3211 998.8863 1024.5557 1067.3101 1094.5847 1111.6493 1125.0989 1135.7833 1142.8304 1154.1270 1165.3571 1188.2174 1210.1588 1248.9925 1249.4136 1281.0310 1294.3484 1324.4419 1335.8015 1351.8382 1376.7241 1401.4987 1406.6208 1424.4176 1458.5259 1464.2015 1473.6594 1486.0909 1516.9519 1607.5590 1625.4333 1631.1664 1645.5024 2893.3432 2991.4891 2995.8192 3012.0634 3068.2298 3070.6845 3092.4925 3107.4288 3108.0413 3124.3322 3138.0593 3461.8732 3571.8262 3575.5001 3596.0365
redmass: 4.1895 4.1002 2.7924 4.5120 8.6037 2.9317 2.8995 5.3001 5.3224 1.5938 2.0247 1.6598 2.2557 5.7588 2.4118 2.9597 1.2636 4.0061 2.1608 1.5684 3.3393 3.9016 3.4994 4.2205 5.2121 1.8976 2.7435 4.2498 4.2264 4.7199 4.9281 3.5367 1.6305 1.3264 2.3319 2.7761 1.7364 1.3564 2.9447 2.4587 2.7070 2.4233 2.4526 2.7875 2.4372 3.3862 1.4709 1.5395 1.3210 1.1421 1.4009 1.4132 1.1383 2.0750 1.4550 2.0409 1.3718 1.5353 1.3443 1.8360 1.2743 5.8627 3.3515 1.1025 1.0403 1.0613 1.0678 3.1881 6.3947 1.1258 5.4889 10.7083 1.0812 1.0640 1.0358 1.0582 1.0980 1.1065 1.0985 1.1029 1.0875 1.0917 1.0960 1.0444 1.0657 1.0662 1.0987
irintensity: 0.3717 0.2641 0.1083 1.6744 2.2523 3.8908 7.8787 0.5526 1.4530 0.7011 27.3130 7.2173 39.6776 15.6187 2.6614 23.7729 63.7330 4.4829 74.0523 124.5641 3.8387 1.9132 12.7936 37.6317 7.1196 99.9264 113.0709 16.6100 1.0747 3.3066 10.4548 28.5845 36.5186 4.1708 4.5215 30.8386 19.9388 1.4569 2.6769 8.9092 7.4874 58.9483 92.8549 50.4547 71.5056 449.5343 5.2519 299.1547 83.1939 5.4625 2.7683 3.4252 0.1318 29.3897 9.4462 42.3247 10.6743 3.7035 4.9267 11.1502 18.7789 6.4843 36.9640 16.6654 12.2787 4.8904 11.9360 97.1066 30.7620 44.5540 25.7270 157.6006 57.8318 37.4971 21.0815 16.4487 9.6376 6.5930 28.7426 43.4305 20.4951 7.1722 13.6315 1.6781 33.7923 35.3317 2.3033
temp: 298.150 k
press: 1.00000 atm
elementType: 8 8 8 8 7 6 6 6 6 6 6 6 6 6 6 6 1 1 1 1 1 1 1 1 1 1 1 1 1 1 1
symmnumber: 1
zpe: 647235.4 jmol-1
zpe.correction: 0.246519 hartree
zpe.thermalcorrener: 0.263655 hartree
zpe.thermalcorrenthalpy: 0.264599 hartree
zpe.thermalcorrgfe: 0.200067 hartree
zpe.sumelectzpe: -782.581304 hartree
zpe.sumelectthermal: -782.564168 hartree
zpe.sumelectthermalent: -782.563224 hartree
zpe.sumelectthermalfe: -782.627756 hartree
dipole: 2.7687 1.8885 2.5030
dipole: 4.1830
quadrupole: -87.2754 -87.0276 -93.0069
quadrupole: -12.7233 -2.8086 5.9944
quadrupole: 1.8279 2.0757 -3.9036 -12.7233 -2.8086 5.9944
hfenergy: -782.827823 hartree
pointgroup: C01 [X(C11H15N1O4)]
dipole: -0.9589472 0.0045761 -1.3374389 debye
polarizability: 172.3765038|8.8469559|131.2966905|10.2573442|-20.3768665|116.5054476 unknown
InChI: InChI=1S/C11H15NO4/c1-2-16-11(15)8(12)5-7-3-4-9(13)10(14)6-7/h3-4,6,8,13-14H,2,5,12H2,1H3
charge 0 multiplicity 1
31 atoms
O  -2.266071 -1.625147 -0.89839
O  -1.403319 -1.035926 1.181015
O  3.336295 -0.42138 2.072728
O  4.875389 0.934069 0.296659
N  -2.997656 1.116262 -0.882583
C  -0.860504 1.677333 0.256158
C  -1.606725 0.66259 -0.650312
C  0.652497 1.502798 0.260805
C  -1.714109 -0.720804 0.011371
C  1.282391 0.62336 1.178363
C  1.465407 2.206702 -0.659807
C  2.68126 0.441452 1.180784
C  2.868242 2.030338 -0.664848
C  3.488622 1.150945 0.248838
C  -2.502429 -3.01525 -0.394396
C  -3.181057 -3.784974 -1.522386
H  -1.278362 1.597321 1.274859
H  -1.104527 2.689869 -0.121805
H  -1.019975 0.530756 -1.590772
H  0.659019 0.062913 1.886908
H  1.006855 2.903797 -1.370836
H  -3.54284 0.484196 -1.476539
H  -3.067979 2.097705 -1.16689
H  3.488222 2.585901 -1.381272
H  -1.524635 -3.447307 -0.114683
H  -3.125652 -2.952252 0.515692
H  -3.365981 -4.827366 -1.204869
H  -4.149426 -3.326773 -1.786966
H  -2.545777 -3.804953 -2.424325
H  2.673237 -0.86126 2.661951
H  5.327489 1.481984 -0.392652
