program: Gaussian 09
title: 000170359
version: EM64L-G09RevD.01
frameworkgroup: C1[X(C21H22ClN3O3)]
method: RPBEPBE
basis: SDD
operation: Freq
keyword: #p
keyword: freq=noraman
keyword: PBEPBE/SDD
title: #p freq=noraman PBEPBE/SDD
converged: YES YES NO NO
title: Mulliken charges:
elementType: Cl O O O N N N C C C C C C C C C C C C C C C C C C C C C H H H H H H H H H H H H H H H H H H H H H H
charge: -0.065648 -0.275341 -0.262374 -0.248506 -0.051900 -0.254822 -0.456122 -0.034804 -0.436555 -0.435129 -0.389704 -0.386450 -0.397324 -0.030255 0.273407 0.139842 0.272332 -0.349084 -0.326670 -0.328021 0.239398 0.241797 -0.224474 -0.076390 -0.371869 -0.377659 -0.226265 -0.225955 0.190459 0.202093 0.269208 0.266680 0.202568 0.214817 0.170997 0.163301 0.228175 0.176629 0.236598 0.255753 0.224101 0.220317 0.334165 0.238390 0.264015 0.253178 0.250411 0.247361 0.227688 0.227639
chargesum: 0.00000
title: Mulliken charges with hydrogens summed into heavy atoms:
elementType: Cl O O O N N N C C C C C C C C C C C C C C C C C C C C C
charge: -0.065648 -0.275341 -0.262374 -0.248506 -0.051900 -0.254822 -0.121957 0.155655 0.034746 0.034119 -0.003889 0.005026 0.015903 0.225498 0.273407 0.139842 0.272332 0.095334 -0.088280 -0.064006 0.239398 0.241797 0.028704 -0.076390 -0.121458 -0.130298 0.001423 0.001685
polarizability: 3.90994700e+02 -4.07933047e+01 2.53124383e+02 9.64466764e+00 8.13472170e+00 1.61525326e+02
1716.lowfreq: -15.8804 -9.8605 -2.4915 -0.0014 0.0008 0.0010 5.5678 10.1318 23.2030
frequency: -7.2577 10.0629 23.0810 37.0322 44.6121 63.5648 83.8143 102.6563 132.8559 140.6548 154.6372 166.6484 195.4379 213.8847 232.5741 242.1276 254.8124 277.8044 288.1285 304.3147 327.1242 345.0220 360.7734 366.9965 386.4798 402.7774 426.8923 448.5584 451.5425 452.2257 465.2811 484.3003 497.9588 539.2008 543.6461 555.4112 559.7831 568.5215 581.3637 591.7313 644.7866 682.6177 695.7224 710.3951 712.1226 714.7110 731.2073 753.4991 758.5720 783.6822 794.5251 799.1968 818.4430 847.2726 851.4046 854.3000 866.9075 897.5663 906.1286 919.0875 931.6113 942.2774 945.8600 965.1262 967.9223 983.9701 995.9456 1024.1325 1034.4482 1057.3373 1058.6080 1067.0630 1079.3345 1103.1338 1109.0148 1113.6824 1119.5420 1130.2734 1142.3521 1151.9142 1160.4742 1161.6047 1175.7213 1182.4379 1211.1517 1225.6637 1232.1575 1237.3838 1262.8083 1265.3831 1270.6039 1284.5675 1291.5906 1295.8612 1306.2265 1314.8391 1323.6920 1332.7678 1334.9303 1344.7872 1347.6701 1358.5153 1371.2369 1383.2052 1389.4994 1398.2947 1407.4557 1441.8178 1450.3254 1452.9472 1455.3598 1456.4660 1467.6335 1468.6732 1472.8606 1477.0063 1490.8171 1591.3085 1606.5512 1611.4279 1629.6524 1676.9640 2797.8903 2810.4404 2844.8164 2984.9382 2988.4073 3001.1040 3004.9256 3006.8272 3027.3940 3040.9552 3047.1286 3078.4639 3083.7925 3090.8976 3136.4478 3150.1726 3155.6313 3162.7025 3173.8731 3174.7170 3180.2526 3619.7623
redmass: 6.6544 7.7503 5.1604 4.5817 6.6663 3.6067 6.7609 8.9841 4.1900 4.0228 5.8646 5.3507 5.4824 4.0739 4.5237 2.1537 5.6211 4.8268 5.2384 3.2163 3.1107 2.4611 5.8939 4.2083 5.0074 4.6958 3.3146 3.1015 2.8492 2.7618 5.6342 3.5975 4.2370 7.7180 4.7178 4.1268 1.1353 4.4636 4.2610 2.8890 3.9067 7.5942 6.9664 10.9627 4.4464 5.1313 4.0497 1.2415 3.7621 3.1433 1.4395 4.1970 1.4794 1.4021 1.4522 3.2115 4.4489 4.7510 2.0185 1.3394 1.3686 3.2789 1.7422 1.2954 6.5766 1.5661 2.3916 2.0131 2.4855 2.3117 2.0189 3.5231 2.5623 2.4060 2.2835 2.4654 2.2506 4.3889 1.6631 2.0119 1.2014 1.8151 2.2393 1.8434 1.2379 1.4082 1.4278 2.0562 1.3546 1.4332 1.3652 1.4711 1.5674 1.5454 1.4177 1.8539 1.2534 1.8074 1.4192 3.0966 1.3850 1.4577 1.4844 1.5955 3.8029 1.6494 3.3518 2.0200 1.1830 3.1791 1.0896 1.1662 1.0919 1.0890 2.6254 1.1097 5.5290 7.5277 7.8585 7.0815 8.1116 8.8407 1.0719 1.0705 1.0705 1.0691 1.0831 1.0795 1.0622 1.0629 1.0850 1.0880 1.0870 1.1025 1.1019 1.1005 1.0852 1.0898 1.0891 1.0947 1.0936 1.1006 1.0962 1.0810
irintensity: 0.0385 0.0108 0.0625 0.1887 0.2361 0.1962 2.1845 2.0030 3.5969 1.9689 2.0029 1.5359 0.9646 1.3847 3.5788 0.6735 0.4371 4.8858 0.8395 1.6470 3.3185 2.2208 1.9875 1.2544 6.1984 7.4951 3.2440 6.8690 6.6433 1.7050 0.2152 1.8689 4.0279 17.9089 0.3077 17.1281 115.0954 10.5952 6.4109 10.7888 11.1392 28.7126 1.6476 9.7714 0.3346 16.9008 0.3837 108.0119 0.4476 15.6932 48.8895 22.1323 0.8700 0.1026 32.8167 5.2415 50.6579 43.7746 4.8441 0.0276 5.3222 2.9267 6.9233 0.1854 75.3503 3.6065 50.6196 15.6943 9.7136 26.2032 19.7995 14.2900 5.1276 25.5065 30.0889 0.1802 11.4063 9.3738 11.8313 48.9828 5.9675 11.7170 45.8953 3.9451 7.9272 58.4055 14.1410 195.2449 16.1535 9.5748 5.1440 13.0024 30.6857 13.0846 10.6556 16.8330 54.0236 125.3962 13.7650 67.7823 6.5807 18.4421 18.5754 7.0283 13.7528 2.8518 22.7814 3.5698 9.2622 51.8385 8.9749 5.6381 7.7427 3.9140 183.1968 13.1469 179.1059 24.0696 49.5272 6.0452 10.0119 631.8584 53.3514 133.9863 148.4856 44.1222 14.4519 41.2157 21.4697 22.5114 50.5037 13.8008 32.1197 6.2202 23.5947 28.1482 1.3149 13.6835 9.0292 15.4830 1.2281 15.3733 2.1187 76.9059
temp: 298.150 k
press: 1.00000 atm
elementType: 17 8 8 8 7 7 7 6 6 6 6 6 6 6 6 6 6 6 6 6 6 6 6 6 6 6 6 6 1 1 1 1 1 1 1 1 1 1 1 1 1 1 1 1 1 1 1 1 1 1
symmnumber: 1
zpe: 1041779.1 jmol-1
zpe.correction: 0.396793 hartree
zpe.thermalcorrener: 0.419809 hartree
zpe.thermalcorrenthalpy: 0.420753 hartree
zpe.thermalcorrgfe: 0.342553 hartree
zpe.sumelectzpe: -1661.394529 hartree
zpe.sumelectthermal: -1661.371512 hartree
zpe.sumelectthermalent: -1661.370568 hartree
zpe.sumelectthermalfe: -1661.448768 hartree
dipole: 1.1262 -3.0905 0.4569
dipole: 3.3209
quadrupole: -195.3577 -157.3987 -172.0718
quadrupole: 8.1567 -0.7415 -1.5913
quadrupole: -20.4150 17.5441 2.8709 8.1567 -0.7415 -1.5913
hfenergy: -1661.7913213 hartree
pointgroup: C01 [X(C21H22Cl1N3O3)]
dipole: 0.4202972 1.2355598 -0.0612481 debye
polarizability: 389.4589695|44.0028806|252.417853|-4.1770887|16.8155714|163.7675871 unknown
InChI: InChI=1S/C21H22ClN3O3/c22-14-5-6-18-17(11-14)23-21(26)25(18)15-7-9-24(10-8-15)12-16-13-27-19-3-1-2-4-20(19)28-16/h1-6,11,15-16,23H,7-10,12-13H2
charge 0 multiplicity 1
50 atoms
Cl 8.966503 0.476824 0.398297
O  -3.935174 0.118441 -0.791031
O  -5.705744 1.298509 1.208517
O  1.944809 -2.433322 -0.112704
N  -1.019574 1.136608 -0.405401
N  3.038292 -0.284003 -0.056271
N  4.31639 -2.131465 0.068256
C  1.850744 0.595139 -0.157811
C  0.881037 0.397839 1.032138
C  1.093858 0.397878 -1.49326
C  -0.326869 1.34585 0.88596
C  -0.114964 1.352991 -1.557969
C  -2.294525 1.875874 -0.504353
C  -3.455802 1.13886 0.178479
C  4.380947 0.136449 0.043298
C  2.967993 -1.702714 -0.042905
C  5.193031 -1.040205 0.122676
C  -4.629636 2.061322 0.542591
C  4.967377 1.414029 0.071244
C  6.591543 -0.969191 0.231847
C  -5.15009 -0.497357 -0.410933
C  -6.01043 0.073454 0.566747
C  6.378359 1.503586 0.180908
C  7.151797 0.326696 0.258173
C  -5.504474 -1.709138 -1.03788
C  -7.204407 -0.582332 0.927738
C  -6.706997 -2.359035 -0.685071
C  -7.552665 -1.800475 0.304754
H  2.235908 1.634471 -0.124968
H  1.402516 0.602299 1.986278
H  0.531329 -0.648858 1.040772
H  0.740624 -0.645953 -1.55468
H  1.769759 0.59231 -2.347215
H  -1.036464 1.158947 1.712969
H  0.019578 2.411855 0.987112
H  0.254844 2.414152 -1.599679
H  -0.682299 1.164044 -2.486869
H  -2.212627 2.908666 -0.075631
H  -2.561748 1.986698 -1.570826
H  -3.110748 0.608763 1.088552
H  -4.328314 2.828895 1.273971
H  -5.0324 2.547953 -0.36846
H  4.558143 -3.119189 0.100539
H  4.368912 2.327637 0.01092
H  7.220981 -1.860462 0.293462
H  6.866994 2.481129 0.205213
H  -4.823269 -2.127309 -1.785637
H  -7.845286 -0.121246 1.685956
H  -6.976876 -3.300793 -1.173959
H  -8.48149 -2.306623 0.587449
