program: Gaussian 09
title: 000170453
version: EM64L-G09RevD.01
frameworkgroup: C1[X(C27H18N2O10S2)]
method: RPBEPBE
basis: SDD
operation: Freq
keyword: #p
keyword: freq=noraman
keyword: PBEPBE/SDD
title: #p freq=noraman PBEPBE/SDD
converged: YES YES NO NO
title: Mulliken charges:
elementType: S S O O O O O O O O O O N N C C C C C C C C C C C C C C C C C C C C C C C C C C C H H H H H H H H H H H H H H H H H H
charge: 0.979451 0.926502 -0.299012 -0.288247 -0.559125 -0.472149 -0.509376 -0.353366 -0.507223 -0.507072 -0.438121 -0.238437 -0.478119 -0.660790 0.077667 0.186363 0.331963 0.400586 -0.392196 0.293894 0.281265 -0.123280 -0.158419 -0.427372 -0.377617 -0.376273 0.453982 -0.225313 -0.224733 -0.403415 -0.333431 0.274915 -0.279100 -0.338989 -0.063627 -0.334648 -0.240130 0.267745 -0.188752 -0.318281 0.126300 0.333311 0.386330 0.294753 0.296254 0.363365 0.393930 0.243342 0.243274 0.251153 0.273263 0.263810 0.260283 0.389315 0.308984 0.293900 0.247291 0.283358 0.390065
chargesum: 0.00000
title: Mulliken charges with hydrogens summed into heavy atoms:
elementType: S S O O O O O O O O O O N N C C C C C C C C C C C C C C C C C C C C C C C C C C C
charge: 0.979451 0.926502 -0.299012 -0.288247 -0.169810 -0.472149 -0.509376 -0.353366 -0.507223 -0.507072 -0.048056 -0.238437 -0.091789 0.096505 0.077667 0.186363 0.331963 0.400586 -0.392196 0.293894 0.281265 -0.123280 -0.158419 -0.094061 -0.082864 -0.080019 0.453982 0.018030 0.018540 -0.152262 -0.060168 0.274915 -0.015290 -0.078706 -0.063627 -0.025664 0.053770 0.267745 0.058540 -0.034924 0.126300
polarizability: 1.28446898e+03 -1.48188329e+02 5.50975831e+02 -1.89474375e+01 -1.50723817e+01 2.07503997e+02
1716.lowfreq: -4.8897 -2.8672 -0.8807 -0.0013 -0.0005 0.0011 4.5562 5.8226 11.2359
frequency: 3.3240 5.7508 11.2149 17.4844 24.4744 29.0569 38.6287 43.5621 53.5007 62.4373 67.5050 77.9399 97.6128 100.1876 108.0622 124.6165 133.8614 142.8342 148.4197 153.0259 172.2862 174.1053 181.0459 186.9471 197.4995 205.5795 219.4923 231.8500 234.9746 238.5711 272.9098 282.3439 300.9813 312.7961 319.7076 333.5503 361.1468 361.7045 379.6084 384.6488 385.5725 396.5075 403.4531 407.9611 417.6628 419.1400 422.1127 426.1205 435.1068 447.8814 458.0800 476.6025 497.1102 500.6104 507.5739 513.6776 523.5313 542.5365 550.1050 583.6774 591.1484 602.9062 622.8931 624.0873 650.9147 653.0775 658.5862 674.0588 679.9117 706.3446 726.0983 726.6473 728.0389 738.6249 769.4828 770.4177 784.6901 792.7322 798.2941 809.2374 813.8778 822.2556 822.9078 828.8690 852.3874 868.1563 875.9984 878.6570 888.3739 909.0732 927.5351 930.9314 936.6232 943.7838 952.4596 959.2229 964.2812 978.3595 979.2177 979.5442 986.6309 999.3449 1008.7231 1016.5352 1021.0539 1023.7495 1044.8093 1054.9589 1063.4057 1087.7782 1090.0972 1116.6626 1136.2780 1149.5459 1162.8860 1171.8141 1177.7323 1179.0061 1243.8066 1248.0475 1251.3447 1275.2221 1278.1895 1295.6019 1299.5285 1314.7592 1322.8967 1347.4937 1359.4714 1377.2417 1389.3235 1393.3218 1407.8840 1420.3794 1426.4720 1444.2822 1450.3680 1458.0944 1459.3088 1473.6585 1484.3831 1508.4994 1521.6351 1528.1309 1569.0182 1573.3513 1590.2081 1599.0680 1606.5082 1607.5089 1612.4753 1632.1217 1646.9395 2971.4370 3140.1588 3140.4609 3149.7492 3150.8641 3156.6189 3157.4872 3163.9891 3166.7022 3169.3606 3173.6403 3176.9379 3179.7379 3185.1471 3228.9198 3461.2262 3473.5039 3532.7402
redmass: 9.1545 8.9235 7.3006 8.6921 9.0372 7.6927 8.4970 9.1800 9.3381 9.0731 4.3054 7.7606 6.2007 9.6560 8.2686 7.6721 7.7631 5.9417 6.3188 7.9886 6.3608 7.3359 4.7194 3.0619 8.5997 10.0275 5.4888 7.4793 4.6096 5.1084 3.3504 5.9150 5.7931 7.3511 8.3886 8.3246 6.7045 9.9963 6.2364 7.7008 7.4072 11.1947 6.8691 4.6386 4.7035 5.3075 4.2871 3.8655 5.5234 6.1799 11.1248 7.2438 6.4638 4.3880 6.4561 5.1577 4.9661 3.6524 8.2645 5.3844 4.7077 1.3511 6.2737 5.7463 6.7617 6.2373 6.7616 3.1349 2.8793 6.0384 1.4846 3.5111 3.5240 2.2303 6.5725 6.6184 4.4631 3.4146 9.6254 1.8372 1.5351 9.6941 1.4948 4.7707 1.8845 1.4314 6.4743 2.1237 4.5645 17.3846 1.4719 1.4226 1.9246 1.4246 9.5083 1.4150 1.3788 1.9749 2.6439 5.8164 2.5193 1.3885 1.3717 1.3685 4.6673 2.7793 1.1624 2.2005 1.9537 1.6366 2.4504 1.3696 2.3172 1.7736 1.3507 1.2161 1.1141 1.8684 2.3277 1.6104 3.1462 1.3591 2.1004 1.8671 1.8076 3.9770 2.3187 3.6205 3.6549 4.3035 7.9317 8.9250 9.2801 2.8526 3.8265 4.6750 2.8845 4.1529 2.6362 2.6104 3.3900 6.4887 6.8474 6.1501 6.7497 2.8571 2.5234 2.6492 5.4771 6.8989 2.3784 5.6881 9.0358 1.0836 1.0903 1.0867 1.0892 1.0879 1.0908 1.0906 1.0928 1.0944 1.0946 1.0968 1.0998 1.0964 1.0973 1.0576 1.0974 1.0667 1.0643
irintensity: 0.8456 0.1186 0.8921 0.5579 0.5772 0.5185 0.7063 0.8021 3.4141 2.9302 1.9463 17.5112 1.4567 22.5136 29.9699 70.3990 2.2383 3.1041 9.7771 4.0634 3.4455 19.9935 13.7412 0.2621 1.7500 2.9128 168.0192 1.6688 0.6208 16.5956 11.9058 2.2973 66.1010 18.5960 23.0832 2.5462 33.2683 15.2201 16.6270 31.3588 5.5188 27.1383 30.6031 120.9602 130.2959 48.2155 49.9024 12.5631 31.9558 7.8931 7.8462 25.2303 3.4610 33.7522 24.3654 14.3047 28.9070 41.9336 123.0511 4.2265 72.9691 170.9156 4.6480 8.2286 6.6401 22.2128 1.5533 15.9064 0.2185 3.3595 66.2816 29.0097 47.8767 11.8052 7.7420 5.5590 17.4040 0.8087 147.7232 44.2969 10.9813 52.2909 17.1613 37.3458 59.3047 100.0133 30.8427 68.0461 67.7366 41.6547 14.4736 163.0126 19.0373 7.6644 53.6029 4.3131 4.0624 3.5573 11.0913 4.0393 4.1089 4.8039 2.5724 0.1148 461.6368 43.3353 86.4585 16.9141 11.4878 67.8963 7.3783 12.8602 106.1368 231.5965 98.6604 9.6114 14.8796 10.0162 19.6081 21.9142 116.2557 52.5740 94.5859 22.7355 290.9600 867.9749 131.1130 128.8498 264.2145 19.5934 3.9632 2.8463 57.9302 92.1169 71.2993 28.5508 18.9973 3.4901 9.9276 8.4885 16.5186 63.5231 828.1669 168.6668 37.6608 7.8209 370.7747 86.2241 26.2223 3.8180 111.9027 133.1952 172.9815 131.9460 4.1786 3.0496 3.2941 5.7890 17.0423 6.6889 3.3268 20.1221 0.6372 4.3707 38.8484 1.3357 8.6438 98.6336 219.5688 41.0037 68.0244
temp: 298.150 k
press: 1.00000 atm
elementType: 16 16 8 8 8 8 8 8 8 8 8 8 7 7 6 6 6 6 6 6 6 6 6 6 6 6 6 6 6 6 6 6 6 6 6 6 6 6 6 6 6 1 1 1 1 1 1 1 1 1 1 1 1 1 1 1 1 1 1
symmnumber: 1
zpe: 1052816.7 jmol-1
zpe.correction: 0.400997 hartree
zpe.thermalcorrener: 0.438282 hartree
zpe.thermalcorrenthalpy: 0.439226 hartree
zpe.thermalcorrgfe: 0.323967 hartree
zpe.sumelectzpe: -2694.398731 hartree
zpe.sumelectthermal: -2694.361446 hartree
zpe.sumelectthermalent: -2694.360502 hartree
zpe.sumelectthermalfe: -2694.475761 hartree
dipole: 1.7378 -3.6555 -4.7615
dipole: 6.2493
quadrupole: -187.6405 -238.4536 -261.5121
quadrupole: -14.1717 16.9316 -16.1400
quadrupole: 41.5615 -9.2515 -32.3100 -14.1717 16.9316 -16.1400
hfenergy: -2694.799728 hartree
pointgroup: C01 [X(C27H18N2O10S2)]
dipole: 0.7604982 -1.6875916 -1.6182648 debye
polarizability: 1298.6782819|-108.078913|522.5729759|-1.809125|-68.624043|221.6975517 unknown
InChI: InChI=1S/C20H13N2O6S.C7H5O4S/c21-18-15(29(26,27)28)9-14(22-10-5-7-11(23)8-6-10)16-17(18)20(25)13-4-2-1-3-12(13)19(16)24;8-7(9)5-2-1-3-6(4-5)12(10)11/h1-9,22,26H,21H2;1-4,8H
charge 0 multiplicity 1
59 atoms
S  3.240656 4.236439 -0.567393
S  -5.202087 1.165257 0.603899
O  2.997357 -2.538559 0.667656
O  7.460876 0.569565 -0.286708
O  3.037416 4.095068 -2.407407
O  1.823617 4.648724 0.084082
O  4.566261 5.131251 -0.270093
O  -4.01812 0.10806 -0.871628
O  -5.288968 2.791753 0.440276
O  -4.798432 0.50226 2.045379
O  -10.057753 -3.136816 -0.05961
O  -8.064108 -3.526134 1.069082
N  1.432008 -0.566379 0.250494
N  6.010041 2.689346 -0.534366
C  3.876621 -0.350141 0.108733
C  5.044184 0.467542 -0.094595
C  2.555901 0.231889 0.066439
C  4.923371 1.893873 -0.33282
C  3.580042 2.410502 -0.299061
C  5.374172 -2.394601 0.399689
C  6.524143 -1.589042 0.166537
C  4.02534 -1.794252 0.398545
C  6.394184 -0.132183 -0.081541
C  2.443596 1.644476 -0.11144
C  5.522956 -3.784907 0.64344
C  7.811934 -2.18227 0.177917
C  0.082731 -0.310458 -0.034282
C  6.804203 -4.366032 0.650856
C  7.951805 -3.562404 0.417381
C  -0.882673 -1.116568 0.650078
C  -0.366219 0.641553 -1.006608
C  -2.703891 -0.005246 -0.569055
C  -2.247473 -0.965414 0.397287
C  -1.733379 0.80412 -1.249028
C  -6.864224 0.460937 0.05805
C  -7.187479 -0.849225 0.427733
C  -7.706217 1.290518 -0.702604
C  -8.443834 -1.357779 0.009852
C  -8.955789 0.766649 -1.107952
C  -9.322817 -0.550207 -0.757705
C  -8.790861 -2.752505 0.403387
H  1.471926 2.141307 -0.034245
H  1.704643 -1.533564 0.57115
H  4.622558 -4.379582 0.822714
H  8.678511 -1.539462 -0.002025
H  5.901437 3.709345 -0.589139
H  6.926493 2.204393 -0.522143
H  6.917677 -5.43907 0.837049
H  8.947638 -4.017812 0.425041
H  -0.535952 -1.843863 1.392756
H  0.352296 1.207107 -1.606357
H  -2.991778 -1.563817 0.930681
H  -2.091877 1.52349 -1.992214
H  2.857597 5.01223 -2.769042
H  -6.516314 -1.468691 1.031164
H  -7.396695 2.311239 -0.949681
H  -9.637887 1.388532 -1.695853
H  -10.285873 -0.964112 -1.068245
H  -10.23759 -4.071231 0.22979
