program: Gaussian 09
title: 000170311
version: EM64L-G09RevD.01
frameworkgroup: C1[X(C15H19N3O2S)]
method: RPBEPBE
basis: SDD
operation: Freq
keyword: #p
keyword: freq=noraman
keyword: PBEPBE/SDD
title: #p freq=noraman PBEPBE/SDD
converged: NO YES NO NO
title: Mulliken charges:
elementType: S O O N N N C C C C C C C C C C C C C C C H H H H H H H H H H H H H H H H H H H
charge: 0.173769 -0.322158 -0.195423 -0.504193 -0.028537 -0.405988 -0.454303 -0.370182 -0.325807 -0.395921 -0.396294 -0.384370 -0.182174 -0.364340 -0.234131 0.334542 0.016558 -0.322016 0.169543 0.270002 -0.492822 0.255531 0.206209 0.214034 0.225883 0.202709 0.202571 0.192191 0.191040 0.203245 0.200970 0.191491 0.258476 0.252903 0.253535 0.306272 0.333669 0.245433 0.245238 0.232847
chargesum: 0.00000
title: Mulliken charges with hydrogens summed into heavy atoms:
elementType: S O O N N N C C C C C C C C C C C C C C C
charge: 0.173769 -0.322158 -0.195423 -0.197921 -0.028537 -0.072319 -0.198773 0.050061 0.102784 -0.001159 -0.002009 0.008091 -0.182174 -0.105863 0.018772 0.334542 0.016558 -0.068481 0.169543 0.270002 0.230695
polarizability: 3.53355616e+02 1.68411211e+01 1.54145766e+02 6.24992461e+00 -1.79947991e+01 1.69388128e+02
1716.lowfreq: -29.3465 -8.9110 0.0007 0.0012 0.0020 3.5324 9.9606 11.4221 20.7445
frequency: -29.3341 9.2981 19.3442 32.2823 51.1627 74.4632 79.6302 108.6253 123.8717 157.3517 192.3805 203.1003 211.0564 222.7843 248.5427 271.1839 300.7649 304.2285 330.1350 333.8370 385.7440 400.3658 427.9697 433.1642 442.3026 478.8460 489.7018 490.9226 578.6327 592.6101 615.2837 663.1210 676.6256 682.0017 699.0378 703.9189 737.1986 762.7732 786.6581 808.7008 835.8803 841.7364 849.0780 871.7283 882.1448 885.9641 888.9425 914.0694 916.0846 961.3931 969.2592 987.2476 1044.1159 1044.3165 1049.8146 1052.8381 1076.8880 1110.2950 1118.1401 1118.7477 1121.0919 1136.3831 1160.4269 1184.4124 1198.8837 1202.1704 1211.7682 1251.7642 1252.3649 1255.7240 1265.8413 1267.1328 1299.6524 1326.8594 1330.1701 1331.1615 1337.2507 1338.4449 1350.9704 1368.4616 1427.3369 1444.4370 1452.7438 1456.9004 1461.7483 1463.4922 1465.7473 1468.9373 1470.8989 1477.9760 1517.1268 1558.5688 1590.7580 1633.0344 1707.2043 2966.7504 2967.4550 2968.4318 2974.3558 2979.7968 3003.3723 3004.8512 3028.8627 3029.7857 3038.6380 3044.4533 3054.4056 3104.5892 3146.4134 3150.2257 3152.4397 3175.6454 3555.4440 3589.3256
redmass: 6.8738 3.5851 3.7914 4.5733 5.5233 5.6918 1.1432 3.8341 3.2656 4.2126 6.6635 4.2870 4.8404 1.9250 4.7802 4.7432 5.0299 2.5419 6.4665 3.4900 6.8743 4.0702 2.6856 2.9826 3.3841 5.0213 1.6324 1.3279 6.6845 1.2249 4.1382 5.9631 7.5013 7.3814 8.9738 3.1573 6.2036 4.0264 1.4452 3.2093 1.4808 6.1876 1.6166 1.4799 4.9526 2.3116 1.6981 5.8131 1.7250 1.3414 8.4823 2.2834 5.0060 2.1221 2.0582 1.1516 1.3008 2.7614 1.5702 1.7887 1.2559 2.0936 1.7646 1.4672 1.4906 1.6732 2.4325 1.6780 1.3037 1.2992 1.5492 2.6608 1.2757 1.4002 2.1607 1.4107 1.4323 1.4794 1.4468 4.6942 1.1556 3.4635 1.0486 3.9964 1.0880 1.0906 1.0889 1.0579 1.0842 1.0946 1.9336 6.6961 8.8793 7.1341 9.0297 1.0630 1.0603 1.0655 1.0620 1.0630 1.0298 1.0839 1.0962 1.0971 1.1014 1.1020 1.1023 1.1049 1.1044 1.0922 1.0894 1.0971 1.0764 1.0812
irintensity: 0.7959 1.6462 1.1917 0.4037 1.7121 0.3749 1.1791 1.0317 0.0364 3.7913 3.3204 2.6141 9.5799 0.5775 11.8490 6.8088 0.8430 0.7151 8.2008 1.0288 0.3439 0.3946 0.8816 6.5528 8.0400 5.8149 2.5511 11.5715 0.6367 170.2239 11.0247 22.1752 4.7020 6.5935 52.9124 9.3986 1.0285 0.1014 0.1010 7.2230 48.4685 6.1086 2.0017 21.5633 1.5250 2.0330 11.1554 25.9168 0.6973 0.5994 6.3657 36.8806 177.3448 51.6680 8.1210 0.0741 0.8645 0.1971 52.3553 0.1787 0.2072 471.4278 94.9378 2.8997 16.4603 26.6806 3.6373 14.3550 1.7544 16.8408 11.4605 36.0888 1.0123 14.4262 43.5150 9.0713 0.7849 0.5196 2.3588 9.3877 5.8883 85.0028 14.0345 14.9558 1.4678 10.8377 5.8977 40.2893 21.3850 2.9917 280.6845 627.3558 217.2205 86.7156 274.7782 33.7318 36.3434 40.7945 14.2990 9.0193 50.7481 12.2504 82.9066 65.6474 28.6706 22.4471 90.2026 26.9430 17.5142 3.2248 3.1031 5.7889 47.7735 35.5198
temp: 298.150 k
press: 1.00000 atm
elementType: 16 8 8 7 7 7 6 6 6 6 6 6 6 6 6 6 6 6 6 6 6 1 1 1 1 1 1 1 1 1 1 1 1 1 1 1 1 1 1 1
symmnumber: 1
zpe: 844990.6 jmol-1
zpe.correction: 0.321840 hartree
zpe.thermalcorrener: 0.341366 hartree
zpe.thermalcorrenthalpy: 0.342310 hartree
zpe.thermalcorrgfe: 0.270556 hartree
zpe.sumelectzpe: -1294.220211 hartree
zpe.sumelectthermal: -1294.200685 hartree
zpe.sumelectthermalent: -1294.199741 hartree
zpe.sumelectthermalfe: -1294.271494 hartree
dipole: 0.7689 4.5263 -3.9768
dipole: 6.0741
quadrupole: -108.2844 -133.8228 -127.6374
quadrupole: 6.7845 -19.0614 -5.4540
quadrupole: 14.9638 -10.5746 -4.3892 6.7845 -19.0614 -5.4540
hfenergy: -1294.5420509 hartree
pointgroup: C01 [X(C15H19N3O2S1)]
dipole: 0.2787654 1.8851351 -1.4419836 debye
polarizability: 353.3063404|17.218246|156.8476501|5.6854828|-18.9943087|166.7355191 unknown
InChI: InChI=1S/C15H19N3O2S/c1-20-15(19)18-14-16-12-8-7-11(9-13(12)17-14)21-10-5-3-2-4-6-10/h7-10,17-18H,2-6H2,1H3
charge 0 multiplicity 1
40 atoms
S  -3.254674 -1.505782 -0.909287
O  6.294435 1.227383 -0.631682
O  5.496271 -0.111064 1.140807
N  1.814689 0.303972 -1.278152
N  2.543551 -0.683313 0.661569
N  4.134357 0.620774 -0.680155
C  -4.033063 0.169407 -0.362714
C  -5.43181 0.259488 -1.00472
C  -4.097858 0.299906 1.169686
C  -6.135455 1.579875 -0.594755
C  -4.793918 1.626193 1.575078
C  -6.202308 1.735133 0.943674
C  -1.506573 -1.25332 -0.375636
C  -0.635889 -0.491463 -1.191109
C  -1.048627 -1.865869 0.827344
C  0.691435 -0.358665 -0.745886
C  1.170904 -0.968671 0.464079
C  0.289802 -1.73512 1.257188
C  2.883569 0.068719 -0.388975
C  5.307412 0.497321 0.07359
C  7.627829 1.222796 0.004991
H  -3.371499 0.9509 -0.783676
H  -6.042149 -0.602383 -0.665206
H  -5.351392 0.189471 -2.106026
H  -3.080301 0.248612 1.599982
H  -4.669438 -0.559064 1.575534
H  -7.152503 1.607787 -1.031373
H  -5.578466 2.438408 -1.024184
H  -4.174922 2.48467 1.240794
H  -4.858156 1.68962 2.678464
H  -6.668773 2.703551 1.20938
H  -6.851919 0.938946 1.36266
H  -0.997632 -0.050908 -2.1254
H  -1.75987 -2.452176 1.417154
H  0.644564 -2.20878 2.176885
H  1.837893 0.840565 -2.143436
H  4.237113 1.178733 -1.529622
H  8.011771 0.19179 0.084891
H  7.574066 1.668675 1.012501
H  8.259435 1.827883 -0.660557
