program: Gaussian 09
title: 000170302
version: EM64L-G09RevD.01
frameworkgroup: C1[X(C15H18OSi)]
method: RPBEPBE
basis: SDD
operation: Freq
keyword: #p
keyword: freq=noraman
keyword: PBEPBE/SDD
title: #p freq=noraman PBEPBE/SDD
converged: YES YES NO NO
title: Mulliken charges:
elementType: Si O C C C C C C C C C C C C C C C H H H H H H H H H H H H H H H H H H
charge: 1.308214 -0.439813 -0.766536 -0.163490 -0.174407 -1.028904 -0.306416 -0.319390 -0.318699 -0.316052 -0.319728 -0.239052 -0.241043 -0.237224 -0.231284 -0.234971 -0.235209 0.239963 0.222301 0.232598 0.249482 0.248004 0.207597 0.217519 0.246485 0.243484 0.224730 0.233368 0.228111 0.228256 0.226674 0.227054 0.229159 0.229674 0.329548
chargesum: 0.00000
title: Mulliken charges with hydrogens summed into heavy atoms:
elementType: Si O C C C C C C C C C C C C C C C
charge: 1.308214 -0.110266 -0.304272 -0.163490 -0.174407 -0.298820 0.118699 -0.072905 -0.075215 -0.091322 -0.086360 -0.010941 -0.012788 -0.010550 -0.004230 -0.005813 -0.005535
polarizability: 2.16718509e+02 -1.38597386e+01 1.87479113e+02 1.85125427e+01 5.44414145e+00 1.45026204e+02
1716.lowfreq: -14.3205 -9.3318 0.0006 0.0016 0.0017 1.3792 21.7876 34.9086 38.7612
frequency: 20.2360 34.8622 38.7527 50.3537 58.8176 71.5096 105.8237 126.8213 144.8525 166.0231 200.8350 208.4999 227.9433 247.7902 262.4429 316.7556 339.8963 390.6495 393.2917 408.0661 438.2536 475.8303 493.8457 614.6857 615.5998 639.8897 683.4115 692.7752 705.7641 707.8505 722.6467 740.0968 751.5246 766.0314 841.7735 843.7247 860.1580 863.9598 925.2489 927.4275 936.9149 954.6344 980.0858 982.3121 987.9305 988.2310 998.8270 999.5750 1022.5618 1023.3362 1032.2151 1074.8276 1076.5685 1100.0013 1103.2495 1112.0133 1173.4216 1173.5186 1187.4268 1197.8288 1201.0940 1275.0043 1293.2425 1310.0163 1313.3144 1322.0145 1363.2777 1364.9926 1375.6750 1417.7218 1419.9540 1435.4128 1446.6518 1450.2973 1470.3852 1471.4512 1477.8520 1575.9016 1577.5209 1596.9481 1597.4453 2961.8893 2969.5995 2982.0174 3032.3269 3072.0546 3083.5697 3090.0528 3109.7933 3112.5147 3113.6808 3115.2824 3128.5548 3128.8379 3140.8038 3140.9519 3158.6793 3159.0717 3556.8406
redmass: 3.7922 3.8830 4.7601 4.4133 3.8229 2.1752 3.1710 2.0845 1.2947 3.6544 3.0135 3.4276 5.2973 4.8874 3.3843 1.5247 2.4677 2.7552 2.7788 5.2537 6.0601 3.3552 3.9353 6.4244 6.4143 4.6796 4.6096 4.0380 1.8468 1.7966 1.9614 1.6970 1.8144 2.0035 1.4200 1.4104 1.2482 1.2459 1.3616 1.3632 3.0568 1.7014 1.4095 1.4357 6.0371 5.5500 1.3131 1.3122 3.0455 2.9403 4.1698 1.7257 1.7109 2.6404 2.8259 1.1383 1.0586 1.0569 1.2745 1.1289 1.1552 1.2134 1.2154 1.4516 1.4164 1.2203 4.3217 5.0494 1.2019 2.1203 2.1261 1.0853 1.0596 1.0566 2.0176 1.9830 1.0843 5.4399 5.5331 5.7907 5.8331 1.0669 1.0603 1.0343 1.0964 1.0983 1.0982 1.0985 1.0871 1.0855 1.0875 1.0860 1.0908 1.0907 1.0957 1.0956 1.1015 1.1015 1.0661
irintensity: 0.0578 0.0053 0.8438 0.2855 0.0894 4.2940 2.5869 0.4637 0.1233 2.0974 1.5586 1.0901 0.1406 1.8086 8.8180 79.1480 68.1395 0.1705 0.0062 15.9288 23.6838 23.5486 40.0802 0.1430 0.0059 5.8718 1.7158 6.3336 58.8390 34.8457 21.5111 110.0005 19.0973 12.2769 95.0050 81.8186 0.7630 0.0659 0.2261 0.4373 63.9524 40.8433 0.1119 0.1706 2.5542 0.6546 0.0810 0.0179 1.4833 2.7575 72.1994 2.3412 1.6755 12.8338 49.0053 70.2737 0.6871 0.4293 39.9591 2.6660 2.4509 3.7478 25.0575 14.8471 6.8945 5.2393 2.7197 1.1810 33.4287 17.9392 11.5612 5.1017 10.4586 5.9597 3.6993 9.2691 1.6749 0.0802 0.0851 0.0119 0.0763 35.0801 30.1513 10.7663 11.3696 34.4367 18.8378 13.3383 8.1644 4.5097 4.5291 3.7736 6.9756 4.7344 53.2081 37.4006 49.8520 18.7177 9.3014
temp: 298.150 k
press: 1.00000 atm
elementType: 14 8 6 6 6 6 6 6 6 6 6 6 6 6 6 6 6 1 1 1 1 1 1 1 1 1 1 1 1 1 1 1 1 1 1
symmnumber: 1
zpe: 747922.6 jmol-1
zpe.correction: 0.284869 hartree
zpe.thermalcorrener: 0.302900 hartree
zpe.thermalcorrenthalpy: 0.303844 hartree
zpe.thermalcorrgfe: 0.236423 hartree
zpe.sumelectzpe: -945.776965 hartree
zpe.sumelectthermal: -945.758933 hartree
zpe.sumelectthermalent: -945.757989 hartree
zpe.sumelectthermalfe: -945.825410 hartree
dipole: -0.6951 -2.1282 -0.6145
dipole: 2.3216
quadrupole: -103.3112 -116.9865 -103.2954
quadrupole: -8.9359 3.1257 -0.5364
quadrupole: 4.5532 -9.1221 4.5689 -8.9359 3.1257 -0.5364
hfenergy: -946.0618335 hartree
pointgroup: C01 [X(C15H18O1Si1)]
dipole: -0.3099976 -0.820439 -0.2551163 debye
polarizability: 213.8869475|-15.5616117|189.0103704|20.9092793|4.1293807|146.3265089 unknown
InChI: InChI=1S/C15H18OSi/c1-17(13-12-16,14-8-4-2-5-9-14)15-10-6-3-7-11-15/h2-11,16H,12-13H2,1H3
charge 0 multiplicity 1
35 atoms
Si 0.07456 0.777399 0.624027
O  2.251612 4.113392 -0.875274
C  0.538236 2.337419 -0.414518
C  -1.697383 0.223685 0.147186
C  1.292528 -0.646941 0.223896
C  0.158108 1.193803 2.488846
C  1.954429 2.869545 -0.136652
C  -2.109518 -1.124578 0.342735
C  1.216097 -1.330837 -1.022763
C  -2.654271 1.144271 -0.362815
C  2.316445 -1.03463 1.13169
C  -3.428042 -1.537399 0.044414
C  2.12957 -2.35734 -1.352763
C  -3.974449 0.736888 -0.66559
C  3.232293 -2.063528 0.808975
C  -4.365481 -0.606183 -0.460129
C  3.142685 -2.726095 -0.436537
H  -0.192011 3.144972 -0.207377
H  0.435637 2.074556 -1.488513
H  1.165473 1.533589 2.792088
H  -0.557462 2.000857 2.729825
H  -0.108115 0.312923 3.100614
H  2.713483 2.091553 -0.365792
H  2.06726 3.163236 0.920973
H  -1.391654 -1.862547 0.722993
H  0.4268 -1.069359 -1.739733
H  -2.373314 2.191575 -0.531974
H  2.403146 -0.536262 2.105442
H  -3.722367 -2.581338 0.203121
H  2.049552 -2.870447 -2.318129
H  -4.69387 1.464019 -1.059827
H  4.011578 -2.345985 1.526331
H  -5.3882 -0.924522 -0.693016
H  3.851329 -3.523143 -0.689382
H  2.144318 3.935254 -1.844271
