program: Gaussian 09
title: 000170262
version: EM64L-G09RevD.01
frameworkgroup: C1[X(C8H7NO2)]
method: RPBEPBE
basis: SDD
operation: Freq
keyword: #pfreq=noraman
keyword: PBEPBE/SDD
title: #p freq=noraman PBEPBE/SDD
converged: YES YES NO NO
title: Mulliken charges:
elementType: O O N C C C C C C C C H H H H H H H
charge: -0.165027 -0.199556 -0.422420 -0.531311 0.313583 -0.383843 0.352380 -0.470001 -0.466599 0.055191 0.076484 0.258222 0.262848 0.241333 0.239113 0.318748 0.267231 0.253624
chargesum: 0.00000
title: Mulliken charges with hydrogens summed into heavy atoms:
elementType: O O N C C C C C C C C
charge: -0.165027 -0.199556 -0.103672 -0.010242 0.313583 0.096603 0.352380 -0.202770 -0.212975 0.055191 0.076484
polarizability: 1.65852988e+02 6.98113491e-01 9.69335715e+01 1.74400743e-01 1.94214569e-01 4.70633885e+01
1716.lowfreq: -17.5289 -0.0004 0.0003 0.0004 3.3676 5.3438 29.6959 74.2343 141.3964
frequency: 27.8861 74.2289 141.3961 203.6537 317.1103 335.9280 362.2724 402.9934 446.0134 460.7033 521.4514 623.3073 633.7526 648.3851 730.3633 754.1602 769.8011 815.6079 825.9430 847.6179 897.0775 947.7206 1043.6521 1045.6042 1122.6141 1140.9486 1176.0740 1194.5453 1222.3041 1236.1290 1254.7283 1288.8216 1313.9224 1403.4076 1416.2532 1450.5515 1497.5653 1540.5468 1582.8196 1637.6606 1667.0152 2983.8268 3013.0259 3039.5005 3074.1947 3144.6172 3152.8909 3590.2483
redmass: 1.9515 6.2968 4.9165 4.3249 4.8360 14.9247 2.6786 9.7682 7.6703 4.3460 1.2431 6.4040 4.8079 4.1871 5.5793 5.0125 2.1473 2.8910 1.6619 1.7440 1.6037 2.7859 3.3090 1.7711 4.4383 3.2411 1.1569 1.1748 1.1989 1.6307 4.0926 1.5929 1.7186 3.5501 1.7502 1.1082 1.0981 9.1928 11.0324 7.4468 8.4886 1.0616 1.0648 1.1008 1.1015 1.0938 1.0924 1.0791
irintensity: 0.7215 0.2512 0.5213 1.4787 1.8276 2.3505 39.8257 4.2009 0.6124 6.2894 98.4035 0.1005 9.0606 2.3216 1.7673 0.5463 7.9692 2.9374 2.8413 59.3857 11.7054 1.5198 6.3200 4.9187 1.7800 18.4624 1.5623 0.7239 0.6082 29.5110 46.8234 22.3049 113.3121 77.1882 1.6343 8.3640 0.8922 353.0122 33.5597 207.6316 15.0208 72.9058 7.0748 24.6471 14.1835 4.9012 4.3549 73.0290
temp: 298.150 k
press: 1.00000 atm
elementType: 8 8 7 6 6 6 6 6 6 6 6 1 1 1 1 1 1 1
symmnumber: 1
zpe: 353023.0 jmol-1
zpe.correction: 0.134459 hartree
zpe.thermalcorrener: 0.143596 hartree
zpe.thermalcorrenthalpy: 0.144541 hartree
zpe.thermalcorrgfe: 0.098971 hartree
zpe.sumelectzpe: -513.439018 hartree
zpe.sumelectthermal: -513.429881 hartree
zpe.sumelectthermalent: -513.428937 hartree
zpe.sumelectthermalfe: -513.474506 hartree
dipole: -10.7343 0.1069 0.0397
dipole: 10.7349
quadrupole: -72.5280 -59.0512 -63.2938
quadrupole: 2.7101 -0.3428 -0.2892
quadrupole: -7.5703 5.9064 1.6638 2.7101 -0.3428 -0.2892
hfenergy: -513.5734772 hartree
pointgroup: C01 [X(C8H7N1O2)]
dipole: 4.222461 -0.0880153 0.0231565 debye
dipolederiv: -0.7613243 -0.2240971 0.0055123 -0.2694128 -0.508878 0.0014548 0.0048372 0.0029072 -0.3090608 -1.0699836 0.1591978 -0.0032763 0.3412132 -0.4609883 0.0000643 0.0051651 0.0000922 -0.3285812 -1.2872343 0.1904607 -0.0079925 -0.4396841 -0.2529873 0.0192736 0.1190435 0.0024708 -0.4497323 -0.2269723 -0.0032861 0.0074795 0.2442503 0.0123763 -0.0118096 0.0801513 -0.0056566 0.1211004 0.5034024 -0.0869352 -0.0216762 -0.2969401 0.1634613 -0.0025426 -0.0509879 -0.01358 -0.0249887 0.4313025 -0.1326517 0.0191238 -0.4438129 0.2455911 -0.0370646 -0.0684953 -0.0102941 0.3453316 1.424021 -0.0912163 0.0040295 0.3044394 0.1498964 0.0050091 -0.0088859 0.0131721 0.1192381 -0.5344242 -0.0823802 0.0096422 0.1497301 -0.0257077 0.002558 0.0079581 0.0081208 -0.145849 -1.1106715 0.0890131 -0.0050868 -0.0516795 -0.0870963 0.0030725 -0.010802 0.0044012 -0.2815831 1.0190153 0.1889718 -0.0116543 0.0929159 0.3733266 0.0010154 -0.0072449 -0.0040527 0.2036687 1.4168944 -0.0918307 0.0029157 0.0728007 0.2574952 0.0000229 -0.004109 -0.0022183 0.1633554 0.0452969 0.0094794 -0.0246504 0.0040111 0.0037512 0.0780587 -0.0544106 0.0961282 0.0203658 0.0427194 -0.0017338 0.0272643 -0.0092211 0.0524484 -0.0647634 0.0395422 -0.0876727 -0.0261223 -0.0697267 0.0190628 -0.0807218 0.0970926 0.0370708 -0.0079158 -0.1803715 -0.0037874 -0.0970269 -0.1092758 0.0080241 0.0874489 0.0623113 0.0545332 0.0184912 0.1587737 0.0208538 -0.0237678 0.1588243 0.0555684 -0.0091882 0.146669 0.1285841 -0.0014985 -0.0298178 -0.0156658 0.3600563 0.0782635 0.0187343 0.0004514 0.0317338 -0.0641864 -0.0012953 0.0004945 -0.002 0.1602243 0.0498731 -0.0243812 0.0003789 -0.036417 -0.0786908 -0.0021307 -0.0008407 -0.0032187 0.1933716 unknown
polarizability: 165.860265|-0.0497149|96.927159|0.0487152|0.0774333|47.0625243 unknown
InChI: InChI=1S/C8H7NO2/c10-7-3-5-1-2-9-6(5)4-8(7)11/h3-4,9H,1-2H2
charge 0 multiplicity 1
18 atoms
O  -2.713097 -1.413447 0.019996
O  -2.740709 1.418931 0.00187
N  2.14073 1.158058 -0.004536
C  2.286079 -1.227437 -0.062168
C  0.842048 -0.751789 -0.016861
C  3.139391 0.071081 0.088776
C  0.827934 0.729014 -0.008735
C  -0.318576 -1.470048 -0.002607
C  -0.339278 1.476914 -0.00671
C  -1.626237 -0.768127 0.00588
C  -1.627325 0.801638 -0.002632
H  2.505022 -1.957825 0.735189
H  2.494764 -1.726764 -1.025775
H  3.661335 0.101194 1.064947
H  3.900205 0.165173 -0.707195
H  2.402365 2.14253 0.024488
H  -0.340492 -2.565621 -0.004877
H  -0.338559 2.571725 -0.000849
