program: Gaussian 09
title: 000170249
version: EM64L-G09RevD.01
frameworkgroup: C1[X(C9H9Cl)]
method: RPBEPBE
basis: SDD
operation: Freq
keyword: #pfreq=noraman
keyword: PBEPBE/SDD
title: #p freq=noraman PBEPBE/SDD
converged: YES YES NO NO
title: Mulliken charges:
elementType: Cl C C C C C C C C C H H H H H H H H H
charge: -0.088880 0.544602 0.481453 -0.511435 -0.375003 -0.400362 -0.223143 -0.778862 -0.200005 -0.565985 0.232330 0.240270 0.232744 0.230618 0.268195 0.266792 0.213933 0.218430 0.214307
chargesum: 0.00000
title: Mulliken charges with hydrogens summed into heavy atoms:
elementType: Cl C C C C C C C C C
charge: -0.088880 0.544602 0.481453 -0.279105 -0.134733 -0.167618 0.007475 -0.243875 0.013929 -0.133248
polarizability: 1.43272647e+02 1.26680297e+01 1.27395017e+02 4.54406217e+00 -4.73084142e+00 5.80075631e+01
1716.lowfreq: -7.3968 -0.0019 0.0019 0.0031 1.4814 2.6462 31.5048 70.3199 100.7024
frequency: 31.4610 70.3149 100.6976 189.8563 208.9190 260.2273 341.2394 419.0363 448.0845 483.1307 546.5573 557.6054 611.1844 692.6698 719.5254 725.6608 820.5783 887.2919 912.7340 922.7439 930.9782 937.7641 986.0124 989.1158 1011.6453 1054.9412 1094.8857 1125.6059 1169.4568 1186.0577 1245.3960 1258.0711 1298.1154 1325.4236 1387.4047 1435.4904 1447.7258 1462.9855 1477.3599 1589.4512 1615.1267 1647.2309 3065.4409 3090.8643 3104.6859 3122.6780 3132.5187 3133.9868 3146.5411 3159.6583 3205.3992
redmass: 5.4218 2.4408 6.6117 2.9080 2.4645 5.1733 2.4400 2.5461 4.2824 3.7047 3.6382 4.5415 3.4584 2.5199 1.7367 4.1989 1.5653 1.8795 1.6498 1.4300 1.9881 1.3517 1.4054 5.1015 1.1828 1.5205 1.6971 1.1074 1.8107 1.0877 1.1398 2.5164 1.4332 1.2626 6.6462 1.3514 2.6555 1.1536 2.3698 5.5833 6.0492 4.4037 1.0576 1.0779 1.0743 1.0871 1.0914 1.0912 1.1111 1.0993 1.1140
irintensity: 1.3810 0.0809 2.0395 1.1726 1.9506 4.5992 0.2302 4.2130 0.2428 10.3193 19.0047 21.2838 30.2739 47.1328 7.1773 4.6704 34.4543 0.9544 1.5338 0.4147 2.3497 88.0825 0.2391 0.5973 22.0848 5.8960 8.1635 1.3909 21.6626 0.2607 16.8505 22.6514 2.5802 1.3865 0.8698 6.4287 1.1058 8.0452 12.7170 7.8225 1.7819 10.0488 22.5678 20.6666 4.1399 4.5783 7.1688 16.2112 6.2926 23.4119 23.1432
temp: 298.150 k
press: 1.00000 atm
elementType: 17 6 6 6 6 6 6 6 6 6 1 1 1 1 1 1 1 1 1
symmnumber: 1
zpe: 393496.8 jmol-1
zpe.correction: 0.149875 hartree
zpe.thermalcorrener: 0.159364 hartree
zpe.thermalcorrenthalpy: 0.160308 hartree
zpe.thermalcorrgfe: 0.113498 hartree
zpe.sumelectzpe: -807.683526 hartree
zpe.sumelectthermal: -807.674036 hartree
zpe.sumelectthermalent: -807.673092 hartree
zpe.sumelectthermalfe: -807.719903 hartree
dipole: -1.8639 1.0970 1.5299
dipole: 2.6492
quadrupole: -66.2311 -59.3915 -69.0882
quadrupole: 2.9605 6.5409 -2.8485
quadrupole: -1.3275 5.5121 -4.1846 2.9605 6.5409 -2.8485
hfenergy: -807.8334006 hartree
pointgroup: C01 [X(C9H9Cl1)]
dipole: 0.6224914 0.4937538 -0.6745742 debye
dipolederiv: -0.5528844 -0.1996707 0.1070055 -0.2828209 -0.3271678 0.0874964 0.4128271 0.2377621 -0.3965319 -0.0897599 -0.0443045 0.0005424 0.0029256 -0.0510506 0.0068053 -0.1206443 -0.0613288 -0.108887 0.1010471 -0.1540153 -0.0189091 -0.1900393 0.0134104 -0.0187032 -0.0129054 -0.0376605 0.0780865 -0.1222644 0.0795479 0.0122936 -0.0401403 0.0192694 0.0401012 -0.010359 0.0311207 -0.1442897 -0.04541 -0.0392364 0.0242393 0.0012992 -0.0360524 0.009168 -0.0010961 0.0287805 -0.1563443 -0.0201949 0.0955508 0.0514105 0.0973553 -0.0535419 0.041611 0.0414877 0.0345041 -0.1693485 -0.1034519 -0.030498 0.012739 -0.0527025 0.1844131 0.0329158 -0.0068402 0.0461236 -0.1184455 0.7023292 0.2809886 -0.1794346 0.3824613 0.3710242 -0.1446662 -0.3291432 -0.2179777 0.5167915 0.3556652 -0.0922991 0.0398665 0.0385615 0.0887824 0.0399893 0.0611764 0.0239373 -0.13989 -0.0718705 0.1378509 0.0626349 0.1967305 -0.1474827 0.0452333 0.0659693 0.040491 -0.3798707 0.0979094 0.0131245 -0.0108004 -0.0028624 -0.0774627 -0.0364717 -0.0025558 -0.0293434 0.1249782 -0.0713531 0.0853954 -0.0226891 0.0592064 0.0675014 -0.0106631 -0.0171955 -0.0016583 0.1440453 -0.0654736 -0.0989838 -0.0426029 -0.0713632 0.0469704 -0.0257304 -0.0396158 -0.0296354 0.1448776 0.0823974 0.0145385 -0.0071469 0.0155397 -0.1259521 -0.0360753 -0.0099242 -0.0420554 0.1499508 0.0335626 0.0294092 0.0861991 -0.0539667 -0.0417284 -0.0589661 0.0654839 -0.0258318 -0.0321123 -0.05021 -0.0006664 -0.0223908 0.0669617 0.0131233 0.1029818 0.011724 0.0698904 -0.0131483 -0.0647218 -0.0341023 -0.0282013 -0.1348718 -0.0250588 -0.0383752 -0.0455414 -0.0275814 0.1430796 -0.0945693 0.0726692 -0.0240196 0.0624919 0.0624148 -0.0079317 -0.0261898 -0.0064798 0.1825755 -0.0207472 -0.1152984 -0.0407362 -0.094766 0.0185879 -0.0287193 -0.0366578 -0.0330572 0.1744834 unknown
polarizability: 146.7595965|-9.529102|124.5216619|-1.1620213|1.7373116|57.3939684 unknown
InChI: InChI=1S/C9H9Cl/c1-2-8-4-3-5-9(6-8)7-10/h2-6H,1,7H2
charge 0 multiplicity 1
19 atoms
Cl -3.225019 -1.457233 0.969228
C  -1.172975 0.015219 -0.330771
C  1.270546 0.124531 0.029139
C  0.09027 -0.615051 -0.253329
C  -1.266728 1.417893 -0.121997
C  1.149661 1.528269 0.229938
C  -0.10572 2.168611 0.156096
C  -2.402456 -0.785854 -0.637069
C  2.611421 -0.493634 0.121061
C  2.924568 -1.812916 -0.001315
H  0.150916 -1.698364 -0.411277
H  -2.244725 1.910423 -0.174109
H  2.049886 2.116609 0.446673
H  -0.177383 3.249993 0.314326
H  -2.196696 -1.695286 -1.219113
H  -3.20032 -0.193243 -1.106484
H  3.432363 0.212689 0.31486
H  3.960243 -2.156011 0.088278
H  2.171047 -2.587245 -0.186837
