program: Gaussian 09
title: 000170250
version: EM64L-G09RevD.01
frameworkgroup: C1[X(C9H18O3)]
method: RPBEPBE
basis: SDD
operation: Freq
keyword: #pfreq=noraman
keyword: PBEPBE/SDD
title: #p freq=noraman PBEPBE/SDD
converged: NO YES NO NO
title: Mulliken charges:
elementType: O O O C C C C C C C C C H H H H H H H H H H H H H H H H H H
charge: -0.461518 -0.243822 -0.285701 -0.407043 -0.376904 -0.339618 -0.065476 -0.358155 -0.354917 -0.694446 0.340681 -0.753058 0.197483 0.236321 0.193382 0.182261 0.189176 0.189159 0.191569 0.193656 0.196275 0.244478 0.225251 0.211441 0.215775 0.210031 0.369174 0.252977 0.249812 0.251758
chargesum: 0.00000
title: Mulliken charges with hydrogens summed into heavy atoms:
elementType: O O O C C C C C C C C C
charge: -0.092344 -0.243822 -0.285701 0.026761 -0.001261 0.041109 0.123700 0.031776 0.114812 -0.057199 0.340681 0.001488
polarizability: 1.40805387e+02 2.10794787e+00 1.01801581e+02 4.23387080e+00 3.12270068e-01 8.45031530e+01
1716.lowfreq: -10.3359 -5.6641 -0.0013 -0.0011 -0.0009 10.4408 33.4677 40.8748 57.3255
frequency: 33.2014 40.7632 57.2030 60.1886 84.8452 95.1111 122.4622 133.3018 161.0286 189.4625 234.4809 247.7199 278.6432 296.1825 333.2893 415.8145 431.4330 495.0436 515.6523 576.4357 638.6536 664.3642 725.1107 744.7424 771.6512 828.0369 876.1481 889.7370 914.7315 951.3295 991.1157 1003.5453 1008.8022 1032.3452 1047.5993 1056.0374 1080.3511 1088.4629 1116.7213 1137.4424 1195.2595 1216.6937 1231.4493 1235.4806 1253.3081 1278.8217 1283.8684 1289.3460 1307.0257 1321.6267 1344.8335 1353.7680 1356.2358 1387.0178 1390.2695 1411.3982 1437.3391 1453.3006 1457.1935 1463.4691 1464.7980 1471.9226 1478.1729 1481.5372 1489.1663 1626.5590 2923.4166 2952.2813 2957.7349 2968.0726 2972.6924 2980.9195 2990.7764 3006.2631 3007.2493 3018.7469 3031.5426 3057.2788 3069.1862 3071.6979 3101.3768 3111.3268 3142.2146 3382.1716
redmass: 4.4250 3.1331 1.4266 1.2702 4.1961 3.3480 2.5924 2.0164 3.5774 4.1963 1.1178 3.0418 3.3896 3.8596 3.6515 3.2219 2.6341 3.0047 3.6949 3.0218 3.3654 1.1996 1.0707 1.3035 2.4625 1.4264 2.6312 1.9108 2.0050 2.6732 1.4622 3.5125 2.0699 2.6473 1.6674 2.9009 2.2888 2.2748 2.4056 1.8296 1.5547 2.8021 1.2979 1.2705 1.2127 1.1340 1.1382 1.1112 1.2447 1.2877 1.3714 1.4373 1.5401 1.2311 1.2163 1.5080 1.0985 1.0614 1.0591 1.0753 1.0694 1.0724 1.0426 1.0755 1.0892 8.0540 1.0829 1.0590 1.0592 1.0594 1.0363 1.0686 1.0927 1.1000 1.0387 1.0613 1.1034 1.1001 1.1006 1.0994 1.0935 1.1042 1.1027 1.0657
irintensity: 0.0755 0.4938 0.4945 0.8899 0.1914 0.8595 0.2569 0.1546 0.9292 6.2955 0.1495 11.9530 6.8718 2.1115 4.0697 7.4828 2.3372 8.1488 11.9477 2.0722 26.2392 124.6946 12.1170 1.4419 3.2782 6.7369 19.5188 1.7475 12.6160 43.9994 3.9120 13.2148 47.9208 4.6751 18.3982 15.8847 0.4183 23.4133 5.0073 6.1256 2.1183 264.3392 39.6797 5.3406 1.0589 16.7536 2.4441 2.5101 11.8809 47.6385 14.7984 1.7125 4.2900 46.1380 10.4209 100.1641 8.4337 22.4949 18.6618 2.2667 0.1394 0.6606 12.4891 4.3248 21.9083 163.6060 40.3035 6.0245 9.6963 83.9289 35.6623 41.7222 11.9734 2.2432 1.7129 24.7136 46.6761 47.7083 95.7957 53.4344 6.9983 15.2483 6.6008 206.9842
temp: 298.150 k
press: 1.00000 atm
elementType: 8 8 8 6 6 6 6 6 6 6 6 6 1 1 1 1 1 1 1 1 1 1 1 1 1 1 1 1 1 1
symmnumber: 1
zpe: 680639.3 jmol-1
zpe.correction: 0.259242 hartree
zpe.thermalcorrener: 0.274319 hartree
zpe.thermalcorrenthalpy: 0.275264 hartree
zpe.thermalcorrgfe: 0.215295 hartree
zpe.sumelectzpe: -578.436025 hartree
zpe.sumelectthermal: -578.420948 hartree
zpe.sumelectthermalent: -578.420004 hartree
zpe.sumelectthermalfe: -578.479972 hartree
dipole: -0.0627 -3.5414 0.5273
dipole: 3.5810
quadrupole: -68.1145 -82.5621 -72.3237
quadrupole: 9.8283 -0.1441 1.2496
quadrupole: 6.2189 -8.2287 2.0097 9.8283 -0.1441 1.2496
hfenergy: -578.6952673 hartree
pointgroup: C01[X(C9H18O3)]
dipole: -0.1482325 1.3335592 0.4296597 debye
polarizability: 140.5389532|3.7527037|98.5057237|-4.9628078|6.6299758|88.0654448 unknown
InChI: InChI=1S/C9H18O3/c1-3-4-5-6-9(11)7-12-8(2)10/h9,11H,3-7H2,1-2H3
charge 0 multiplicity 1
30 atoms
O  -0.996903 -2.216236 -0.786596
O  -2.316005 0.744499 0.086794
O  -3.527246 -1.206025 -0.318343
C  1.052539 -0.969424 -0.61695
C  1.92222 -0.004086 0.217953
C  3.410707 -0.035116 -0.198334
C  -0.4408 -0.984084 -0.227734
C  4.299234 0.913286 0.638339
C  -1.16919 0.269524 -0.764651
C  5.783557 0.875664 0.214604
C  -3.444518 -0.05511 0.184816
C  -4.549029 0.641899 0.944204
H  1.146341 -0.736969 -1.697743
H  1.416118 -2.006032 -0.489433
H  1.838114 -0.271013 1.292191
H  1.547276 1.037318 0.128147
H  -0.523388 -0.98014 0.884193
H  3.498955 0.233365 -1.271991
H  3.793945 -1.072553 -0.1064
H  3.913443 1.949478 0.547563
H  4.21201 0.642494 1.710501
H  -1.544389 0.073654 -1.786965
H  -0.511637 1.152127 -0.7599
H  6.20074 -0.143293 0.323136
H  6.398412 1.559554 0.828202
H  5.901044 1.173686 -0.84452
H  -1.99347 -2.156796 -0.713498
H  -4.137283 1.371278 1.657975
H  -5.169389 -0.103648 1.464357
H  -5.194609 1.186699 0.230883
