program: Gaussian 09
title: 000170235
version: EM64L-G09RevD.01
frameworkgroup: C1[X(C13H17ClO2)]
method: RPBEPBE
basis: SDD
operation: Freq
keyword: #p
keyword: freq=noraman
keyword: PBEPBE/SDD
title: #p freq=noraman PBEPBE/SDD
converged: YES YES NO NO
title: Mulliken charges:
elementType: Cl O O C C C C C C C C C C C C C H H H H H H H H H H H H H H H H H
charge: -0.130820 -0.246880 -0.118424 -0.360857 -0.348387 -0.403444 -0.354793 -0.323051 -0.692840 0.365831 -0.363271 -0.333567 -0.341621 -0.296454 0.415052 -0.187156 0.189620 0.189959 0.191697 0.191900 0.218209 0.218032 0.195503 0.195586 0.216306 0.215935 0.218361 0.210960 0.210953 0.262571 0.258304 0.272480 0.264308
chargesum: 0.00000
title: Mulliken charges with hydrogens summed into heavy atoms:
elementType: Cl O O C C C C C C C C C C C C C
charge: -0.130820 -0.246880 -0.118424 0.018722 0.035209 0.032797 0.036295 0.109190 -0.052566 0.365831 -0.100700 -0.075263 -0.069142 -0.032145 0.415052 -0.187156
polarizability: 2.67424423e+02 7.58042655e+00 1.55316634e+02 6.60952951e-02 -1.11212693e-01 8.75349121e+01
1716.lowfreq: -32.9281 -8.0862 -3.7467 0.0023 0.0028 0.0029 17.5310 19.3093 32.8878
frequency: -18.8702 18.3253 32.8835 55.4275 56.4386 101.1922 105.4937 106.1261 139.1148 157.4649 174.3254 179.3809 237.0971 261.8126 284.5590 297.4834 367.0936 400.0837 414.6724 422.2105 492.1612 494.7802 499.3141 615.2838 623.0657 644.5386 722.9066 738.6774 747.8677 776.0163 803.7329 825.2769 846.9538 853.0556 889.0885 890.4296 956.1128 970.9464 986.3183 988.3228 998.4842 1011.4565 1048.5896 1071.3219 1084.4635 1125.3991 1128.0758 1147.5254 1175.5694 1195.9213 1216.7832 1237.8322 1244.3103 1246.7616 1280.2702 1290.0856 1293.2627 1295.0878 1303.2463 1341.0456 1355.2267 1371.1914 1381.0859 1391.1816 1438.7790 1462.1631 1464.0468 1468.6076 1475.1939 1478.8456 1483.1957 1488.1459 1493.9065 1562.0221 1616.5747 1710.0073 2953.1667 2957.6236 2959.3505 2968.6548 2973.6364 2991.0733 2995.3813 3007.0912 3018.0232 3033.0980 3064.7522 3070.4022 3073.5895 3155.5682 3162.4329 3176.0292 3181.6540
redmass: 1.7180 4.8673 5.0942 4.1756 4.5968 2.2644 4.0904 2.7484 2.7686 2.6273 5.9540 5.7262 1.0973 4.1134 6.9082 6.4168 10.3397 3.4862 2.9918 4.7307 5.4008 3.2237 4.2622 7.1549 4.4948 7.4642 1.0677 4.2345 1.1004 6.9493 1.1665 1.2542 7.3324 1.6355 1.1936 1.8873 7.8499 1.3504 1.3183 1.1588 2.6806 3.8239 3.0990 2.6843 2.1139 1.8293 1.7024 1.4460 1.3700 1.5287 3.0721 1.3011 3.0685 1.2954 1.0765 1.1282 1.0957 1.3205 1.2934 1.4285 1.6251 3.1644 1.6829 1.2151 4.6974 1.0764 1.0746 1.1074 1.1113 1.0423 1.1508 1.1381 1.8928 7.0189 6.3928 12.8103 1.0580 1.0567 1.0580 1.0591 1.0361 1.0980 1.0590 1.1016 1.1063 1.1049 1.1054 1.1009 1.0993 1.0886 1.0879 1.0970 1.0967
irintensity: 0.0360 0.8504 0.4969 0.2191 0.0048 0.6152 0.5480 0.2048 0.8662 5.6404 1.3345 1.4360 0.0050 0.5090 0.3744 18.0269 14.8772 4.5061 0.1139 0.3189 2.1372 6.8492 3.2717 58.9398 24.4654 85.5929 12.3577 2.8207 0.5588 39.6113 7.7949 1.9741 157.8114 68.5357 2.2763 7.3597 91.1509 0.9487 0.1444 0.1800 1.9523 2.4060 21.2522 15.1608 7.2115 2.0888 15.2094 1.4003 336.8993 0.0058 112.0752 0.7026 346.9496 0.0819 0.0240 0.0418 0.9627 2.7544 1.8659 0.8099 0.1314 2.1951 24.1436 12.3955 24.8702 0.4554 0.3188 18.7094 8.3407 12.9091 31.9124 23.6024 30.9384 86.0855 336.8113 354.6648 0.9905 10.2949 19.3714 93.5038 38.3836 1.4728 36.3155 1.7675 17.9685 36.5253 49.5228 113.9529 51.1427 0.3048 3.9855 3.9971 7.4908
temp: 298.150 k
press: 1.00000 atm
elementType: 17 8 8 6 6 6 6 6 6 6 6 6 6 6 6 6 1 1 1 1 1 1 1 1 1 1 1 1 1 1 1 1 1
symmnumber: 1
zpe: 707550.6 jmol-1
zpe.correction: 0.269492 hartree
zpe.thermalcorrener: 0.286016 hartree
zpe.thermalcorrenthalpy: 0.286960 hartree
zpe.thermalcorrgfe: 0.222600 hartree
zpe.sumelectzpe: -1114.883180 hartree
zpe.sumelectthermal: -1114.866656 hartree
zpe.sumelectthermalent: -1114.865712 hartree
zpe.sumelectthermalfe: -1114.930072 hartree
dipole: 7.4502 -0.4703 0.0005
dipole: 7.4650
quadrupole: -135.9329 -101.1354 -104.2385
quadrupole: -4.4420 -0.0156 -0.0591
quadrupole: -22.1640 12.6335 9.5304 -4.4420 -0.0156 -0.0591
hfenergy: -1115.1526719 hartree
pointgroup: C01 [X(C13H17Cl1O2)]
dipole: -2.9333976 0.1018058 -0.1030897 debye
polarizability: 266.4221194|9.8515827|152.8910347|9.6040753|14.2682716|90.962815 unknown
InChI: InChI=1S/C13H17ClO2/c1-2-3-4-5-10-16-12-8-6-11(7-9-12)13(14)15/h6-9H,2-5,10H2,1H3
charge 0 multiplicity 1
33 atoms
Cl 5.638358 1.935432 0.68629
O  -0.493004 -0.894563 -0.167849
O  5.966834 -0.722028 0.138883
C  -4.044502 0.507181 -0.032881
C  -5.433738 -0.145558 -0.212538
C  -2.885858 -0.506758 -0.180679
C  -6.599337 0.860629 -0.075998
C  -1.522428 0.158015 0.009455
C  -7.984134 0.201539 -0.253909
C  0.844443 -0.54506 -0.038438
C  1.773047 -1.606543 -0.227587
C  1.310242 0.764587 0.261072
C  3.144985 -1.360922 -0.117824
C  2.691319 1.002799 0.369719
C  3.626703 -0.047799 0.183639
C  5.083697 0.124818 0.281095
H  -3.995298 0.987929 0.966627
H  -3.925948 1.321058 -0.77848
H  -5.485707 -0.631781 -1.208852
H  -5.559349 -0.955098 0.536076
H  -2.920577 -0.97712 -1.181863
H  -2.997312 -1.319641 0.561975
H  -6.545791 1.348431 0.918754
H  -6.473498 1.668089 -0.825984
H  -1.3582 0.957471 -0.741781
H  -1.427326 0.592954 1.025391
H  -8.799956 0.940266 -0.151395
H  -8.075625 -0.266226 -1.252332
H  -8.147243 -0.589034 0.502607
H  1.388007 -2.604093 -0.457404
H  0.611615 1.592068 0.408851
H  3.866943 -2.17107 -0.261736
H  3.056339 2.007329 0.600297
