program: Gaussian 09
title: 000170226
version: EM64L-G09RevD.01
frameworkgroup: C1[X(C11H24O3)]
method: RPBEPBE
basis: SDD
operation: Freq
keyword: #pfreq=noraman
keyword: PBEPBE/SDD
title: #p freq=noraman PBEPBE/SDD
converged: YES YES NO NO
title: Mulliken charges:
elementType: O O O C C C C C C C C C C C H H H H H H H H H H H H H H H H H H H H H H H H
charge: -0.301054 -0.263714 -0.276337 0.085284 -0.541181 -0.030172 -0.420129 -0.700031 -0.211168 -0.227152 -0.206104 -0.681895 -0.684458 -0.683500 0.206957 0.255574 0.221464 0.235543 0.202286 0.204968 0.225778 0.209036 0.236141 0.189342 0.185870 0.186899 0.220776 0.192714 0.211155 0.201196 0.225470 0.226370 0.224453 0.222971 0.202264 0.227607 0.223305 0.203472
chargesum: 0.00000
title: Mulliken charges with hydrogens summed into heavy atoms:
elementType: O O O C C C C C C C C C C C
charge: -0.301054 -0.263714 -0.276337 0.292241 -0.064143 0.205371 -0.012874 -0.029076 0.164044 0.180523 0.197766 -0.028860 -0.034770 -0.029117
polarizability: 1.46789409e+02 -6.02558659e-01 1.29662474e+02 9.97336145e-01 1.56613948e+00 1.22597205e+02
1716.lowfreq: -8.2274 -0.0003 0.0005 0.0009 3.4715 12.4903 23.9401 35.6196 38.7680
frequency: 23.4067 35.2891 38.4107 51.8221 55.2333 64.8569 79.3943 84.6382 133.8055 138.6090 172.0104 200.0857 207.3139 223.7954 227.7778 237.5480 249.3421 250.3034 303.0416 322.6440 348.1153 381.2241 405.8479 505.7920 538.0388 606.6058 624.2797 746.9747 769.2611 790.4416 808.0948 815.9717 816.9600 835.0379 876.7191 889.9866 937.7451 970.1593 987.8025 1004.2966 1027.9958 1046.0163 1056.3431 1078.3045 1084.8906 1097.5239 1109.1057 1112.5197 1134.4322 1137.1337 1138.1887 1143.5022 1160.2641 1224.8505 1245.3560 1249.8404 1252.8459 1255.2853 1265.9792 1300.3042 1328.4496 1339.8594 1350.6125 1359.5782 1366.9927 1379.0959 1384.0159 1389.3202 1390.6643 1395.8882 1396.5987 1449.3516 1458.1676 1458.6089 1458.9104 1467.8878 1476.2981 1477.9691 1478.9235 1481.4591 1491.1504 1492.7929 1493.6756 1496.1693 2925.1382 2931.9543 2947.5681 2948.8589 2972.9051 2976.5405 2985.7041 2988.9198 2991.5101 2991.8320 3010.5845 3013.3788 3017.3456 3018.8992 3021.5143 3076.5138 3083.0767 3086.1758 3086.6068 3088.5500 3089.4095 3095.1536 3098.2220 3098.4339
redmass: 3.1115 2.7673 2.9431 1.8190 2.5677 2.3646 2.4259 2.0975 2.5725 3.0113 2.4698 1.5192 2.1048 2.5433 1.3023 1.5376 1.4996 1.9447 2.6237 2.4660 3.6165 3.2975 2.3798 2.9691 3.7532 2.4828 3.7826 2.6820 1.8953 1.7253 1.1101 1.1154 1.1124 2.5897 2.8503 2.7668 2.6057 3.7294 1.7917 1.6584 2.5066 3.0166 3.7649 3.4852 2.3793 2.2461 2.1041 2.0962 1.6696 1.4570 1.4959 1.8406 2.0805 1.4225 1.1575 1.1878 1.1694 1.1676 1.2258 1.3111 1.2096 1.4093 1.2697 1.3316 1.2941 1.3079 1.3352 1.2342 1.2596 1.3143 1.3595 1.0871 1.0416 1.0416 1.0411 1.0743 1.0475 1.0496 1.0456 1.0448 1.0642 1.0812 1.0710 1.0839 1.0572 1.0796 1.0600 1.0598 1.0885 1.0773 1.0376 1.0358 1.0359 1.0357 1.0836 1.0969 1.0988 1.0868 1.0831 1.0998 1.1000 1.0990 1.0999 1.0989 1.0990 1.1011 1.1010 1.1009
irintensity: 0.0849 0.1844 0.2999 1.3916 0.3294 0.9332 1.1530 2.2392 7.0583 0.3583 7.9770 0.3625 3.3427 3.7402 0.3877 0.3817 5.1676 2.9254 2.5292 1.4033 9.5011 1.4521 6.8015 9.6081 3.3172 3.7925 1.8807 12.8635 5.5619 11.1778 1.9857 5.2880 4.4283 11.3746 50.6695 25.7103 34.9925 149.8334 20.2489 9.6359 65.9593 105.0450 53.1106 146.1061 35.0778 1.4831 15.7118 12.9194 23.8241 11.5294 0.2109 11.8809 9.8820 6.6290 0.9765 4.2425 3.7633 0.4454 3.1588 11.3019 22.7770 27.3616 6.4171 4.8808 5.3827 10.9260 13.1167 12.9691 30.8036 16.2593 18.8997 13.5864 9.1491 10.0577 10.5552 8.2467 2.5166 8.8868 10.4906 2.7659 17.5886 7.6886 2.5268 0.3488 46.1243 43.3842 54.6238 51.2353 72.0341 42.8156 24.9852 29.7691 31.2182 22.9842 18.9131 15.7503 36.7454 18.2562 42.9575 53.9114 18.2813 21.4132 53.8314 39.1200 38.3634 45.6528 41.9605 40.9985
temp: 298.150 k
press: 1.00000 atm
elementType: 8 8 8 6 6 6 6 6 6 6 6 6 6 6 1 1 1 1 1 1 1 1 1 1 1 1 1 1 1 1 1 1 1 1 1 1 1 1
symmnumber: 1
zpe: 883362.0 jmol-1
zpe.correction: 0.336455 hartree
zpe.thermalcorrener: 0.355417 hartree
zpe.thermalcorrenthalpy: 0.356361 hartree
zpe.thermalcorrgfe: 0.286937 hartree
zpe.sumelectzpe: -658.016641 hartree
zpe.sumelectthermal: -657.997679 hartree
zpe.sumelectthermalent: -657.996735 hartree
zpe.sumelectthermalfe: -658.066159 hartree
dipole: -0.2130 1.2663 -0.4251
dipole: 1.3527
quadrupole: -80.6428 -84.7705 -90.2360
quadrupole: -2.3600 1.1200 2.9409
quadrupole: 4.5736 0.4460 -5.0196 -2.3600 1.1200 2.9409
hfenergy: -658.353096 hartree
pointgroup: C01 [X(C11H24O3)]
dipole: 0.1100711 -0.5200023 0.0263318 debye
polarizability: 146.8455032|0.1716109|127.6535383|0.1176506|-3.5605612|124.5500454 unknown
InChI: InChI=1S/C11H24O3/c1-5-10(12-6-2)9-11(13-7-3)14-8-4/h10-11H,5-9H2,1-4H3
charge 0 multiplicity 1
38 atoms
O  2.096181 0.591548 -0.453922
O  -1.175243 -1.10722 -0.613859
O  -2.038121 0.96359 0.299468
C  1.511289 -0.323426 0.555421
C  0.178645 0.327172 0.958699
C  -0.85444 0.260505 -0.172821
C  2.471627 -0.562699 1.74556
C  2.868205 0.720741 2.50664
C  3.140804 -0.018388 -1.289288
C  -1.724069 -1.993014 0.43649
C  -3.023465 1.235774 -0.770528
C  3.481389 0.982367 -2.394876
C  -2.333218 -3.203334 -0.272549
C  -4.215064 1.941264 -0.124995
H  1.302084 -1.299376 0.060055
H  0.350299 1.390886 1.198182
H  -0.228221 -0.155296 1.866544
H  -0.454622 0.720337 -1.09813
H  1.989903 -1.283503 2.43774
H  3.385683 -1.064738 1.370628
H  2.004832 1.167414 3.032202
H  3.645999 0.507285 3.262231
H  3.263058 1.476436 1.804335
H  2.763646 -0.973698 -1.717975
H  4.042419 -0.247216 -0.680382
H  -0.912077 -2.311318 1.124308
H  -2.48358 -1.440314 1.024115
H  -2.548093 1.87586 -1.545036
H  -3.322153 0.28109 -1.247433
H  4.278087 0.582435 -3.04879
H  2.591579 1.193767 -3.012715
H  3.83119 1.933715 -1.957438
H  -1.570938 -3.721968 -0.880053
H  -3.150395 -2.888675 -0.944833
H  -2.740344 -3.919545 0.465053
H  -3.894929 2.879968 0.359403
H  -4.677864 1.297664 0.643374
H  -4.97898 2.181811 -0.887124
