program: Gaussian 09
title: 000170230
version: EM64L-G09RevD.01
frameworkgroup: C1[X(C13H9F3O2)]
method: RPBEPBE
basis: SDD
operation: Freq
keyword: #p
keyword: freq=noraman
keyword: PBEPBE/SDD
title: #p freq=noraman PBEPBE/SDD
converged: YES YES NO NO
title: Mulliken charges:
elementType: F F F O O C C C C C C C C C C C C C H H H H H H H H H
charge: -0.169162 -0.169927 -0.170666 -0.298987 -0.428881 0.288510 0.338416 -0.314892 -0.328860 -0.362197 -0.333020 0.322220 0.259047 -0.330560 -0.345904 -0.322088 -0.349538 0.281716 0.264363 0.261206 0.265222 0.273080 0.267730 0.259496 0.259255 0.227150 0.357270
chargesum: 0.00000
title: Mulliken charges with hydrogens summed into heavy atoms:
elementType: F F F O O C C C C C C C C C C C C C
charge: -0.169162 -0.169927 -0.170666 -0.298987 -0.071611 0.288510 0.338416 -0.050528 -0.067655 -0.096975 -0.059940 0.322220 0.259047 -0.062830 -0.086408 -0.062833 -0.122388 0.281716
polarizability: 2.32506791e+02 -1.44898812e+01 1.25984931e+02 -1.47283219e+01 -4.40950719e+00 9.67026417e+01
1716.lowfreq: -9.3521 -2.3818 -0.0010 -0.0008 -0.0005 5.0641 14.3642 19.2566 41.6343
frequency: 13.7739 18.7467 41.4946 58.1796 85.8705 135.1005 171.6154 207.8176 242.1550 302.9637 331.9057 355.5616 366.6954 370.5386 371.5975 411.3077 415.7492 419.4838 466.9173 490.8484 515.7271 537.8026 558.6307 590.1169 625.1587 631.2648 665.9756 708.9881 725.3267 738.6192 799.8309 803.1467 827.4129 835.2279 843.3701 854.9778 925.9581 952.9079 959.3848 973.5868 974.1654 989.6179 998.4917 1018.8201 1022.9686 1094.8654 1128.3063 1141.3179 1151.3446 1171.4728 1183.0555 1224.8032 1255.2970 1285.7121 1297.6829 1305.1686 1377.9779 1389.8916 1423.5923 1426.3663 1489.5893 1500.9620 1586.5518 1597.1282 1617.9664 1628.5300 3125.5364 3153.9241 3157.1599 3160.1051 3172.2243 3176.5940 3178.8728 3181.3014 3585.2606
redmass: 11.9957 4.6739 6.8903 4.3284 9.2282 8.1091 8.2903 8.6692 8.2260 7.5561 7.0544 1.1162 8.3266 7.5632 8.6565 3.0758 3.0449 4.1069 5.8546 3.7090 7.6981 6.1089 3.7096 5.5041 7.3177 7.3861 7.4638 4.4763 4.7156 5.3130 2.2955 1.9676 1.5013 1.3531 1.6180 6.3544 1.3470 1.3986 1.5300 1.3860 4.4558 6.2007 2.7890 5.8034 3.1531 1.3713 1.3473 1.3723 1.8214 1.2806 1.4981 2.6191 3.4023 4.4015 1.3535 1.2875 5.5391 6.1537 3.6590 3.5961 2.6444 2.7268 7.4757 7.0030 6.3859 6.5950 1.0903 1.0894 1.0887 1.0889 1.0951 1.0962 1.0969 1.0976 1.0662
irintensity: 0.0552 0.4555 0.1123 0.5367 1.4391 1.2140 0.4870 0.4698 2.9069 6.4545 5.7773 145.9949 4.5300 3.2708 4.0364 3.1513 0.5712 7.2895 2.5178 28.6021 4.6524 20.9186 17.1251 10.4405 7.6680 0.3933 0.8951 2.9445 6.9641 23.7375 21.3043 7.9277 54.5776 39.0378 79.6223 23.7226 0.8555 16.9507 41.8873 8.5602 191.4876 136.3883 7.8511 160.9938 98.4116 58.4374 8.0265 278.7677 6.4340 6.2126 195.6187 282.4929 12.5096 491.0104 11.9545 2.5187 19.5485 21.4399 9.2412 13.4721 292.1355 9.2073 14.0159 7.4044 110.5981 73.9308 18.5201 7.1259 1.4491 1.6849 3.7122 2.4074 1.2645 1.2764 51.8722
temp: 298.150 k
press: 1.00000 atm
elementType: 9 9 9 8 8 6 6 6 6 6 6 6 6 6 6 6 6 6 1 1 1 1 1 1 1 1 1
symmnumber: 1
zpe: 493605.3 jmol-1
zpe.correction: 0.188004 hartree
zpe.thermalcorrener: 0.203461 hartree
zpe.thermalcorrenthalpy: 0.204405 hartree
zpe.thermalcorrgfe: 0.142141 hartree
zpe.sumelectzpe: -949.474001 hartree
zpe.sumelectthermal: -949.458544 hartree
zpe.sumelectthermalent: -949.457600 hartree
zpe.sumelectthermalfe: -949.519864 hartree
dipole: 5.4443 0.9773 -1.3524
dipole: 5.6942
quadrupole: -106.0235 -101.6810 -100.3205
quadrupole: -4.2076 -12.6132 0.1958
quadrupole: -3.3486 0.9940 2.3545 -4.2076 -12.6132 0.1958
hfenergy: -949.6620051 hartree
pointgroup: C01 [X(C13H9F3O2)]
dipole: 2.1610015 0.4275653 -0.4076204 debye
polarizability: 232.1416147|-14.1021965|127.2101837|-15.8884299|2.7453226|95.8425649 unknown
InChI: InChI=1S/C13H9F3O2/c14-13(15,16)9-1-5-11(6-2-9)18-12-7-3-10(17)4-8-12/h1-8,17H
charge 0 multiplicity 1
27 atoms
F  -5.216213 0.694148 -0.310957
F  -4.479342 -1.107915 -1.488325
F  -4.724469 -1.239704 0.757261
O  1.080712 1.41322 0.523051
O  5.792963 -1.569686 -0.284401
C  -2.871634 0.090056 -0.117303
C  -0.208647 0.900415 0.297028
C  -2.597976 1.27859 0.604835
C  -1.806819 -0.685815 -0.632419
C  -1.269538 1.685693 0.81064
C  -0.471777 -0.286252 -0.430704
C  2.232103 0.607278 0.266797
C  -4.283266 -0.372647 -0.291674
C  2.463882 -0.588264 0.985701
C  3.186498 1.107037 -0.639312
C  3.661076 -1.299496 0.7794
C  4.391305 0.398264 -0.841966
C  4.623155 -0.807016 -0.135368
H  -3.421676 1.884031 0.994793
H  -2.020045 -1.594603 -1.20362
H  -1.032287 2.60101 1.359465
H  0.348521 -0.880897 -0.841398
H  1.722643 -0.950552 1.705164
H  2.985968 2.042438 -1.169343
H  3.871214 -2.225502 1.321732
H  5.139093 0.785492 -1.545351
H  6.412356 -1.151825 -0.932628
