program: Gaussian 09
title: 000170219
version: EM64L-G09RevD.01
frameworkgroup: C1[X(C8H11NO)]
method: RPBEPBE
basis: SDD
operation: Freq
keyword: #p
keyword: freq=noraman
keyword: PBEPBE/SDD
title: #p freq=noraman PBEPBE/SDD
converged: YES YES NO NO
title: Mulliken charges:
elementType: O N C C C C C C C C H H H H H H H H H H H
charge: -0.312148 -0.687360 0.479768 0.217573 0.301274 -0.478773 -0.441758 -0.372398 -0.820202 -0.530897 0.234102 0.222396 0.214181 0.221920 0.222579 0.221601 0.331477 0.296997 0.221214 0.221194 0.237258
chargesum: 0.00000
title: Mulliken charges with hydrogens summed into heavy atoms:
elementType: O N C C C C C C C C
charge: -0.312148 -0.058885 0.479768 0.217573 0.301274 -0.244671 -0.219362 -0.158218 -0.154101 0.148770
polarizability: 1.30294952e+02 4.10810391e+00 1.13959889e+02 -9.11594014e-03 -2.45963090e-02 5.08874689e+01
1716.lowfreq: -7.3243 -0.0009 -0.0008 -0.0006 6.3227 10.6339 41.3228 90.8818 139.6446
frequency: 40.9608 90.8546 139.6441 190.6995 195.5157 260.9311 285.4023 311.0655 351.0043 351.8493 438.4209 455.4903 463.6308 515.4135 530.6441 584.6224 698.4558 726.9220 788.0368 800.9412 848.3621 899.4960 915.4078 990.8282 1011.2643 1029.3788 1043.4607 1116.5696 1145.8966 1150.2824 1164.7494 1240.6250 1287.8231 1322.8626 1391.9120 1398.0024 1426.6952 1447.0774 1464.1077 1469.5360 1475.2630 1478.5427 1529.9411 1593.6999 1606.1553 1639.9614 2955.6486 2964.9551 3037.8320 3040.8748 3076.0070 3114.8055 3117.4189 3135.2020 3140.7824 3569.8505 3718.3418
redmass: 1.0475 3.0776 3.5730 1.7971 2.9989 1.5781 2.8969 1.2019 3.1634 3.6954 2.2413 5.4114 1.1924 3.2117 5.6551 3.5379 5.9279 3.4485 4.3104 1.4230 1.4041 4.1676 1.3524 1.7365 3.6266 1.4541 1.4941 1.2611 1.9312 1.3839 1.4869 2.7028 1.5014 2.9254 2.0116 1.6991 2.4696 1.5695 1.0497 1.0464 1.0656 1.1095 3.4790 4.8543 1.4163 4.3091 1.0328 1.0374 1.0978 1.1037 1.0977 1.0869 1.0992 1.0915 1.0954 1.0441 1.1047
irintensity: 0.0430 7.2710 6.0894 1.6220 2.8514 3.5129 5.8135 198.5646 1.9044 53.0181 16.5132 0.1304 51.6084 3.0922 7.0795 12.7633 1.3896 0.1667 10.6510 55.9303 13.3497 7.0727 1.4501 0.6841 46.4457 2.5744 10.1783 0.2647 124.5543 2.0185 11.0920 67.6745 4.0341 87.1441 3.5898 1.7187 1.5487 3.6948 11.3423 13.7632 45.1075 15.4845 182.1677 12.7991 87.4388 144.8347 63.5091 67.1104 25.6849 56.1711 22.4784 20.9220 26.4500 32.5268 9.1476 74.3366 32.2971
temp: 298.150 k
press: 1.00000 atm
elementType: 8 7 6 6 6 6 6 6 6 6 1 1 1 1 1 1 1 1 1 1 1
symmnumber: 1
zpe: 455658.3 jmol-1
zpe.correction: 0.173551 hartree
zpe.thermalcorrener: 0.184067 hartree
zpe.thermalcorrenthalpy: 0.185012 hartree
zpe.thermalcorrgfe: 0.137675 hartree
zpe.sumelectzpe: -440.666095 hartree
zpe.sumelectthermal: -440.655579 hartree
zpe.sumelectthermalent: -440.654635 hartree
zpe.sumelectthermalfe: -440.701971 hartree
dipole: 1.2614 -0.7399 -0.0018
dipole: 1.4624
quadrupole: -53.2982 -46.6489 -64.9510
quadrupole: -0.0733 -0.0134 -0.0095
quadrupole: 1.6678 8.3171 -9.9850 -0.0733 -0.0134 -0.0095
hfenergy: -440.8396461 hartree
pointgroup: C01 [X(C8H11N1O1)]
dipole: 0.4982172 -0.2877808 0.0037448 debye
dipolederiv: -1.1252932 0.6315674 -0.0086835 0.5798473 -0.8688348 0.006968 -0.0082869 0.0068576 -0.3002238 -1.1452426 -0.6488945 0.003516 -0.6392537 -0.5353409 -0.004993 0.0025504 -0.0057257 -0.7384465 0.0261846 0.0593043 -0.0006135 0.252712 -0.0005048 0.0002248 -0.0070372 -0.0036301 -0.0685982 0.8665455 -0.5950265 0.008156 -0.8459635 0.1812357 -0.0046698 0.0106493 -0.0029845 0.0364855 0.9509233 0.8051676 -0.0025727 0.9383852 0.3031217 0.002586 -0.003575 0.0020373 0.0904073 -0.0766062 0.0296251 0.0003963 -0.0546816 0.0034462 -0.0025586 0.0019489 -0.0019657 -0.2113657 -0.0318178 0.1493697 -0.0006388 -0.1886948 0.0896376 -0.0030856 0.002534 -0.0014382 -0.189759 -0.1762304 -0.3742031 0.0035874 0.120118 0.076321 -0.0023336 -0.0004446 -0.004197 -0.2221372 0.0338903 -0.0261729 -0.0002714 -0.0777623 0.0177971 0.0001856 0.0046257 0.003597 0.0962245 0.2836885 -0.0738042 0.0003853 -0.3824262 0.7413889 -0.0047976 0.0028042 -0.0034877 0.3326795 0.1080272 0.0167443 -0.0005253 0.0285502 -0.1157102 0.0024449 -0.0006526 0.0021146 0.1569704 -0.1135417 0.0918514 -0.002219 0.0788309 0.0509861 0.0011007 -0.0023666 0.0013875 0.1576485 0.066702 -0.0197693 -0.000364 -0.0052072 -0.1606208 0.0028841 -0.0007043 0.0027596 0.1692054 0.0241172 -0.0357324 0.0200403 -0.0899475 -0.0392956 -0.1223659 -0.0600878 -0.1490831 -0.0545867 0.0206967 -0.0437204 -0.0142857 -0.092739 -0.0271357 0.1185022 0.0669812 0.1467834 -0.0668376 -0.0997849 0.0518733 -0.004617 0.1665056 0.0033484 0.0049974 -0.0067318 0.0025423 0.1050923 0.2351212 0.04168 -0.0009273 -0.0100847 0.1993531 0.0016456 -0.0000713 0.0020393 0.3886352 0.1667863 0.0445396 -0.0013809 0.0598349 0.1518146 0.0024701 -0.0011702 0.0027933 0.3872506 0.0696076 -0.1008643 -0.1080912 0.0602786 -0.064826 -0.0595816 -0.0506065 -0.1024679 -0.0942404 0.0682589 -0.1000491 0.1109857 0.0604994 -0.0623984 0.0597053 0.0510686 0.1011641 -0.0953489 -0.1520324 0.096514 -0.0018769 0.0411983 0.0562166 0.000671 -0.0014276 0.0009039 0.1209451 unknown
polarizability: 130.2382268|4.2191316|114.0107892|0.2821325|-0.5363367|50.8932945 unknown
InChI: InChI=1S/C8H11NO/c1-6-3-4-7(9)8(5-6)10-2/h3-5H,9H2,1-2H3
charge 0 multiplicity 1
21 atoms
O  2.038547 -0.741722 0.013096
N  1.841699 1.918456 -0.009404
C  -1.738811 -0.410939 -0.006116
C  0.71513 -0.237714 0.003561
C  0.651694 1.193033 -0.008818
C  -0.452111 -1.020627 0.004876
C  -1.803614 1.000315 -0.0189
C  -0.630748 1.792996 -0.020058
C  -2.995257 -1.266745 -0.002602
C  2.203792 -2.192263 0.024683
H  -0.382929 -2.114432 0.014217
H  -2.782208 1.494911 -0.0282
H  -0.709268 2.887094 -0.030087
H  -3.031035 -1.945766 -0.876515
H  -3.057216 -1.900152 0.903706
H  -3.903131 -0.639304 -0.031679
H  2.723437 1.414118 -0.001793
H  1.83616 2.932659 -0.019159
H  1.757481 -2.654471 -0.877799
H  1.749994 -2.641037 0.930194
H  3.290595 -2.364909 0.030496
