program: Gaussian 09
title: 000170278
version: EM64L-G09RevD.01
frameworkgroup: C1[X(C15H16O9S)]
method: RPBEPBE
basis: SDD
operation: Freq
keyword: #p
keyword: freq=noraman
keyword: PBEPBE/SDD
title: #p freq=noraman PBEPBE/SDD
converged: NO YES NO NO
title: Mulliken charges:
elementType: S O O O O O O O O O C C C C C C C C C C C C C C C H H H H H H H H H H H H H H H H
charge: 1.003374 -0.309829 -0.253391 -0.553243 -0.243955 -0.505042 -0.483349 -0.510656 -0.188347 -0.340278 0.039688 0.128957 0.348441 -0.246869 -0.333895 -0.713400 0.219267 -0.346199 -0.250783 -0.211732 0.115847 0.241422 0.343487 -0.749356 -0.607678 0.252736 0.271054 0.230873 0.272155 0.220534 0.251848 0.284465 0.305521 0.256286 0.413044 0.443274 0.242944 0.244823 0.222987 0.238806 0.256168
chargesum: 0.00000
title: Mulliken charges with hydrogens summed into heavy atoms:
elementType: S O O O O O O O O O C C C C C C C C C C C C C C C
charge: 1.003374 -0.309829 -0.253391 -0.140199 -0.243955 -0.505042 -0.483349 -0.067382 -0.188347 -0.340278 0.292425 0.128957 0.348441 -0.246869 0.168032 0.031137 0.219267 -0.061733 0.054738 0.044555 0.115847 0.241422 0.343487 -0.038602 -0.112704
polarizability: 2.47484720e+02 -1.90294941e+01 2.38793725e+02 -1.57426945e+01 -6.49408271e+00 1.74558545e+02
1716.lowfreq: -11.4736 -7.6548 -4.6976 -0.0009 -0.0008 0.0014 17.1479 27.5868 45.6372
frequency: 16.8370 27.5728 45.6239 47.9019 55.2064 68.4842 80.6636 81.7915 102.1092 126.8717 130.5758 139.7199 157.0993 171.5517 183.3439 187.5547 205.7538 212.3881 230.0591 236.7808 238.6680 254.6705 275.7527 284.1290 309.7741 324.1712 342.2738 355.9427 369.3447 377.2593 387.3427 405.1534 424.4394 433.8192 457.5074 493.9887 502.7284 542.2054 566.8182 571.7480 576.6069 601.2099 626.6071 636.0055 673.5682 688.5358 714.3163 750.3675 760.5658 774.6008 780.9978 792.2738 827.1259 829.7351 834.8335 849.4306 890.4229 929.3943 940.6692 961.6701 968.4101 974.5848 1001.8532 1006.9503 1011.0367 1012.1434 1054.2148 1055.4373 1065.1460 1087.5337 1112.9730 1125.5962 1139.1838 1160.2962 1187.4673 1194.2157 1238.8795 1242.9726 1257.1909 1281.6263 1296.5160 1329.7906 1345.8948 1365.3354 1371.7139 1396.2364 1400.0315 1412.9448 1418.2370 1444.5433 1451.6907 1457.5240 1467.4529 1471.4271 1492.7313 1551.6065 1581.5881 1597.5519 1616.0041 1647.3615 1667.1205 2970.6229 2994.1451 3001.3088 3033.3673 3040.2244 3077.3277 3095.7355 3104.4918 3109.9034 3112.0539 3122.8391 3149.9946 3155.2529 3159.9271 3177.6698 3221.4040
redmass: 4.7595 5.4666 3.7132 5.9085 6.7932 8.5999 7.3410 3.5969 10.3136 7.7612 8.8903 7.4794 1.1311 5.8889 4.9722 6.8271 5.1959 1.5909 5.8573 4.0619 3.4029 7.5302 7.4248 3.4055 7.7204 9.6430 7.3601 3.6813 5.0352 3.8164 2.9532 6.0960 3.6926 8.1806 4.5713 4.7390 5.6787 4.8040 5.0860 5.7503 3.6655 1.3772 1.5541 3.0431 6.0785 8.4396 8.4159 4.8703 3.3609 2.9530 2.2724 4.2472 1.4422 5.8072 2.0936 8.3341 2.5403 1.6740 1.8639 1.3815 10.7021 2.7149 1.3788 3.1916 1.5421 1.5229 2.4223 1.8556 2.9667 2.6369 2.1209 2.9297 2.5119 2.2476 1.4216 1.8587 1.2835 1.5833 1.5504 1.4235 3.3236 1.3997 1.3842 7.7282 1.5215 1.2072 1.1685 2.5095 1.2548 3.0034 1.1033 1.0445 1.0585 1.0625 1.0466 6.9311 8.9277 7.7576 10.2249 4.9542 10.3723 1.0709 1.0366 1.0370 1.0642 1.0791 1.0973 1.0998 1.1006 1.0624 1.1075 1.1003 1.0884 1.0676 1.0911 1.0994 1.1158
irintensity: 0.2892 0.3965 1.0224 2.0044 4.3822 1.7838 0.8428 0.9398 0.9447 4.8557 0.9023 10.4595 1.0839 2.8181 0.9993 8.6399 2.2021 0.3571 1.1102 2.6864 3.6390 23.1509 4.6639 4.2719 9.0400 4.1840 10.2123 13.4691 7.2482 4.5156 3.6763 23.8811 24.8748 34.4835 7.2451 3.1801 3.6077 4.8328 68.6285 38.1010 4.2635 80.0847 45.7254 31.1228 3.2370 7.1861 4.7215 59.2256 22.1327 38.1432 32.1660 32.2752 344.9583 8.6567 54.4103 104.5385 13.8669 0.7554 7.3045 0.2732 68.7947 36.9536 64.6398 28.2926 32.1677 7.6733 21.1577 45.8966 141.1100 114.2644 30.3234 249.4811 149.9799 58.9789 81.5450 65.9426 130.1353 124.4357 128.8031 8.5964 119.1072 5.5157 55.5685 8.5802 18.9008 34.1482 25.0794 8.4902 11.8607 5.2474 21.9152 16.0963 31.5854 36.6491 16.1446 19.6938 223.7966 94.1775 120.7550 3.4928 190.1291 1501.0434 7.7793 13.5616 19.8925 17.7413 14.3495 16.7971 19.3033 2.4140 13.9845 4.3974 2.5684 206.8212 17.3957 5.8066 3.6145
temp: 298.150 k
press: 1.00000 atm
elementType: 16 8 8 8 8 8 8 8 8 8 6 6 6 6 6 6 6 6 6 6 6 6 6 6 6 1 1 1 1 1 1 1 1 1 1 1 1 1 1 1 1
symmnumber: 1
zpe: 767714.5 jmol-1
zpe.correction: 0.292407 hartree
zpe.thermalcorrener: 0.318184 hartree
zpe.thermalcorrenthalpy: 0.319129 hartree
zpe.thermalcorrgfe: 0.235622 hartree
zpe.sumelectzpe: -1654.233144 hartree
zpe.sumelectthermal: -1654.207366 hartree
zpe.sumelectthermalent: -1654.206422 hartree
zpe.sumelectthermalfe: -1654.289929 hartree
dipole: -8.4988 3.3831 -3.6449
dipole: 9.8469
quadrupole: -147.7405 -154.7599 -155.4085
quadrupole: 23.7140 -11.2871 5.9558
quadrupole: 4.8958 -2.1236 -2.7722 23.7140 -11.2871 5.9558
hfenergy: -1654.5255507 hartree
pointgroup: C01 [X(C15H16O9S1)]
dipole: 3.1952615 0.3584195 2.1610611 debye
polarizability: 235.6133319|30.913806|203.9378481|0.4659393|32.1139451|221.2858107 unknown
InChI: InChI=1S/C15H16O9S/c1-8(2)14(18)23-7-9(3)24-15(19)10-5-4-6-11(25(20,21)22)12(10)13(16)17/h4-6,9,16,20H,1,7H2,2-3H3
charge 0 multiplicity 1
41 atoms
S  -3.175108 -1.432315 -1.804622
O  0.91347 1.029368 0.998779
O  3.606815 0.575181 -0.140301
O  -1.8251 -2.612888 -2.150547
O  0.147902 1.348753 3.177844
O  -4.517012 -2.318415 -1.71885
O  -3.056221 -0.15143 -2.785092
O  -0.033452 -0.603718 -1.559273
O  -0.610839 1.635536 -1.235035
O  2.439443 -0.129153 -2.031292
C  2.045812 1.998737 1.169098
C  -1.246047 0.157607 1.56955
C  -1.568036 -0.114178 0.203771
C  -2.706166 -0.911032 -0.029876
C  2.868115 1.866993 -0.112905
C  1.514147 3.43416 1.319965
C  -0.021936 0.906291 2.016144
C  -2.096836 -0.313397 2.603343
C  -3.55603 -1.392204 0.976325
C  -3.248492 -1.06994 2.316354
C  -0.719789 0.436877 -0.930473
C  3.318806 -0.338006 -1.144146
C  4.179514 -1.554898 -1.046229
C  5.162731 -1.664305 0.099828
C  4.021635 -2.505411 -2.010847
H  2.625058 1.68736 2.057678
H  2.221267 1.947849 -1.0032
H  3.6483 2.645738 -0.130128
H  0.916511 3.53055 2.238961
H  2.359922 4.141784 1.389492
H  0.889121 3.708777 0.452595
H  -1.823008 -0.07133 3.634997
H  -4.42433 -2.002439 0.705762
H  -3.895645 -1.420809 3.125373
H  -0.97956 -2.048296 -2.076257
H  0.845623 -0.304984 -1.99398
H  5.88771 -0.83115 0.083444
H  4.644885 -1.613066 1.074108
H  5.717143 -2.615626 0.045069
H  4.615169 -3.425549 -2.002808
H  3.297807 -2.371918 -2.821919
