program: Gaussian 09
title: 000170231
version: EM64L-G09RevD.01
frameworkgroup: C1[X(C12H6Br4O4S)]
method: RPBEPBE
basis: SDD
operation: Freq
keyword: #p
keyword: freq=noraman
keyword: PBEPBE/SDD
title: #p freq=noraman PBEPBE/SDD
converged: YES YES NO YES
title: Mulliken charges:
elementType: Br Br Br Br S O O O O C C C C C C C C C C C C H H H H H H
charge: 0.064651 0.064644 0.089437 0.089428 0.873583 -0.518322 -0.518336 -0.376007 -0.376013 -0.094970 -0.094894 -0.189267 -0.189294 -0.214587 -0.214611 -0.365454 -0.365457 -0.350036 -0.350046 0.552120 0.552124 0.298194 0.298174 0.303865 0.303882 0.363598 0.363593
chargesum: 0.00000
title: Mulliken charges with hydrogens summed into heavy atoms:
elementType: Br Br Br Br S O O O O C C C C C C C C C C C C
charge: 0.064651 0.064644 0.089437 0.089428 0.873583 -0.518322 -0.518336 -0.012409 -0.012419 -0.094970 -0.094894 0.108927 0.108880 0.089279 0.089271 -0.365454 -0.365457 -0.350036 -0.350046 0.552120 0.552124
polarizability: 2.84482113e+02 -5.74199261e+00 3.05437772e+02 -1.19008039e-02 -1.72333195e-02 1.52130244e+02
1716.lowfreq: -4.3945 0.0010 0.0013 0.0019 1.1425 1.6111 7.7899 13.9885 18.2034
frequency: 7.7709 13.9855 18.2029 82.6072 83.6181 83.7928 84.1964 102.3011 107.5027 120.4284 158.5420 183.1429 191.5752 202.6826 205.7389 212.3963 225.8132 254.8522 266.1204 272.2381 275.2593 322.7336 333.3641 369.4613 408.5479 410.6228 455.3966 470.4704 471.0155 497.1967 498.3325 525.1368 534.1254 571.3184 581.7218 635.1354 656.3836 699.7204 701.2169 738.6795 740.2894 778.6639 808.7090 816.6191 888.9510 892.8683 900.8639 901.4872 932.9203 1030.7864 1032.1512 1070.8040 1080.8304 1129.5662 1132.0577 1216.6519 1218.9936 1273.7899 1274.8223 1372.7092 1375.6956 1386.3834 1387.6784 1438.2423 1441.1419 1563.5000 1564.1336 1572.9027 1575.3324 3164.0472 3165.8414 3166.0813 3168.1098 3469.9963 3470.2374
redmass: 42.1270 33.2484 22.2604 16.2449 13.4416 24.1541 11.0640 8.1101 23.1800 30.8861 11.8044 5.3050 4.7196 22.3754 17.6455 11.5537 10.8626 8.2618 11.7447 12.0525 12.2533 9.0727 10.2595 7.4209 10.6306 8.3457 11.3994 1.1999 1.2087 3.5885 3.8502 4.8621 4.9581 4.1847 4.2799 11.3725 11.5500 9.4160 9.4640 6.2907 6.4258 12.5298 6.6291 7.2292 1.4370 1.3643 1.4351 1.3829 14.2824 7.0828 6.6011 2.2312 2.3040 1.4822 1.4914 1.5351 1.5794 2.0001 2.0893 3.6613 3.6556 6.9287 7.0904 3.6504 3.6530 8.1538 8.4190 7.9962 8.0082 1.0922 1.0933 1.0924 1.0936 1.0648 1.0649
irintensity: 0.1024 0.2312 0.0330 2.6703 1.1438 0.0035 0.0325 2.5842 0.0509 0.3264 0.1013 0.6288 0.2768 1.6983 0.0559 0.0113 4.0965 2.9605 6.2277 22.6401 4.0837 14.7699 16.8867 0.3992 14.3236 9.2885 171.5246 98.7222 153.3445 22.1184 10.0260 10.5760 16.6705 45.4680 25.6943 0.5398 13.9840 0.5002 142.4807 10.1561 14.5183 57.0617 31.2893 55.2830 9.0926 5.2198 14.3690 2.3920 36.8683 30.9013 10.2882 192.1980 40.1357 89.1635 269.4099 71.2812 158.2871 48.3567 0.0137 19.2841 211.8346 13.9512 46.2251 155.0843 38.0623 3.6202 23.3055 1.1937 40.8386 0.0855 16.3350 12.8203 11.8891 162.1487 16.9069
temp: 298.150 k
press: 1.00000 atm
elementType: 35 35 35 35 16 8 8 8 8 6 6 6 6 6 6 6 6 6 6 6 6 1 1 1 1 1 1
symmnumber: 1
zpe: 397382.7 jmol-1
zpe.correction: 0.151355 hartree
zpe.thermalcorrener: 0.173102 hartree
zpe.thermalcorrenthalpy: 0.174046 hartree
zpe.thermalcorrgfe: 0.094639 hartree
zpe.sumelectzpe: -1211.984925 hartree
zpe.sumelectthermal: -1211.963178 hartree
zpe.sumelectthermalent: -1211.962234 hartree
zpe.sumelectthermalfe: -1212.041641 hartree
dipole: -0.0006 0.0007 -4.4345
dipole: 4.4345
quadrupole: -152.3181 -161.2899 -186.3732
quadrupole: -17.4714 0.0001 0.0015
quadrupole: 14.3423 5.3705 -19.7128 -17.4714 0.0001 0.0015
hfenergy: -1212.1362801 hartree
pointgroup: C01 [X(C12H6Br4O4S1)]
dipole: -0.0022026 -0.0000731 1.7446544 debye
polarizability: 284.1596102|5.1100754|305.7600711|0.1616599|-0.0306641|152.1304474 unknown
InChI: InChI=1S/C12H6Br4O4S/c13-7-1-5(2-8(14)11(7)17)21(19,20)6-3-9(15)12(18)10(16)4-6/h1-4,17-18H
charge 0 multiplicity 1
27 atoms
Br -4.079403 -2.935199 0.861864
Br 4.076082 2.935201 0.870552
Br -3.962846 2.864363 1.078929
Br 3.958363 -2.864308 1.088471
S  0.001236 0.000007 -1.914789
O  0.006167 -1.447619 -2.676577
O  -0.001864 1.447715 -2.67646
O  -4.910834 0.011705 1.64531
O  4.905489 -0.011648 1.656297
C  -1.51002 -0.013436 -0.774132
C  1.510029 0.013416 -0.770584
C  -2.038651 1.217892 -0.356357
C  2.037557 -1.217902 -0.35143
C  -2.073227 -1.25788 -0.455999
C  2.072637 1.257867 -0.451464
C  -3.215742 -1.245155 0.359662
C  3.213342 1.245164 0.366728
C  -3.182809 1.197612 0.461226
C  3.17991 -1.197587 0.468679
C  -3.790467 -0.033283 0.84032
C  3.786876 0.033314 0.84886
H  -1.588803 2.159512 -0.685288
H  1.588342 -2.159538 -0.681177
H  -1.650058 -2.182896 -0.858918
H  1.650396 2.182829 -0.855482
H  -5.250622 -0.905965 1.830494
H  5.245019 0.906019 1.841967
