program: Gaussian 09
title: 000170204
version: EM64L-G09RevD.01
frameworkgroup: C1[X(C4H12Cl2Si2)]
method: RPBEPBE
basis: SDD
operation: Freq
keyword: #p
keyword: freq=noraman
keyword: PBEPBE/SDD
title: #p freq=noraman PBEPBE/SDD
converged: YES YES NO NO
title: Mulliken charges:
elementType: Cl Cl Si Si C C C C H H H H H H H H H H H H
charge: -0.309890 -0.309888 0.853566 0.631240 -0.978686 -0.971663 -0.978685 -0.985687 0.258355 0.248653 0.239774 0.241663 0.258395 0.258393 0.239774 0.248650 0.258366 0.286634 0.255518 0.255517
chargesum: 0.00000
title: Mulliken charges with hydrogens summed into heavy atoms:
elementType: Cl Cl Si Si C C C C
charge: -0.309890 -0.309888 0.853566 0.631240 -0.231904 -0.213212 -0.231895 -0.188018
polarizability: 1.18603274e+02 4.31191389e-04 1.17158508e+02 7.07200330e-02 1.30509412e-04 1.06442863e+02
1716.lowfreq: -8.1024 -0.0010 0.0029 0.0032 8.0251 11.2195 17.7111 62.4128 72.8732
frequency: 14.8776 62.3981 72.8527 124.9239 125.4892 139.2062 144.4748 145.4427 146.2712 178.5076 179.9976 190.8096 213.3539 216.2550 221.8306 329.6388 451.7162 455.2621 597.3274 703.6002 705.1215 713.8155 755.7619 800.3591 805.3466 865.6454 867.6349 911.6903 917.3522 923.4640 1297.7197 1299.2994 1312.3508 1317.7444 1426.8644 1435.9835 1439.1581 1444.9980 1445.9352 1449.3968 1450.9358 1460.6271 2982.5880 2982.9057 2985.7061 2994.2539 3083.3224 3084.1735 3089.1895 3095.5207 3095.8310 3100.4653 3103.4601 3108.9872
redmass: 3.8104 5.7511 3.8026 1.0116 6.0734 1.0238 1.0762 3.2282 3.2859 3.3315 3.0029 1.0288 3.3669 3.5103 3.6102 7.2951 9.2980 15.5515 4.2372 3.5709 3.4771 5.6178 1.1696 1.2809 1.2958 1.3136 1.3087 1.4621 1.4492 1.4847 1.1909 1.1894 1.1789 1.1818 1.0485 1.0525 1.0509 1.0536 1.0535 1.0468 1.0481 1.0474 1.0344 1.0342 1.0342 1.0334 1.0982 1.0978 1.0982 1.0989 1.0987 1.0987 1.0992 1.0990
irintensity: 0.4063 0.3704 3.4309 0.0003 2.7973 0.0000 0.1287 0.1908 2.3943 1.8287 0.2822 0.0061 1.0473 7.0099 18.1179 14.1470 40.5568 72.5042 4.8476 8.3745 1.9780 38.2480 0.0118 5.5349 6.3487 141.8709 35.3161 64.4466 69.1048 139.0206 40.2454 37.4598 14.2901 22.6349 6.9224 3.5697 13.9327 0.0207 0.0423 15.8401 17.8632 15.3652 10.8799 13.3975 10.5134 3.2800 0.6438 16.6875 10.4981 2.7860 13.9416 6.0480 5.0758 2.2892
temp: 298.150 k
press: 1.00000 atm
elementType: 17 17 14 14 6 6 6 6 1 1 1 1 1 1 1 1 1 1 1 1
symmnumber: 1
zpe: 397566.0 jmol-1
zpe.correction: 0.151425 hartree
zpe.thermalcorrener: 0.166134 hartree
zpe.thermalcorrenthalpy: 0.167078 hartree
zpe.thermalcorrgfe: 0.108219 hartree
zpe.sumelectzpe: -1657.967228 hartree
zpe.sumelectthermal: -1657.952519 hartree
zpe.sumelectthermalent: -1657.951574 hartree
zpe.sumelectthermalfe: -1658.010433 hartree
dipole: 3.6938 0.0000 2.6426
dipole: 4.5417
quadrupole: -79.9231 -85.9254 -77.3797
quadrupole: -0.0001 -4.7697 0.0003
quadrupole: 1.1530 -4.8493 3.6963 -0.0001 -4.7697 0.0003
hfenergy: -1658.1186527 hartree
pointgroup: C01 [X(C4H12Cl2Si2)]
dipole: -1.3764473 0.0003658 -1.1394152 debye
dipolederiv: -0.5565884 -0.1889883 -0.0789025 -0.214656 -0.6811054 -0.1979703 -0.0834788 -0.190152 -0.4499932 -0.5566309 0.189086 -0.0787526 0.21475 -0.6813679 0.1977739 -0.0833179 0.1899643 -0.4496804 1.3626177 0.0000244 0.0125839 0.0000661 0.8357947 0.0000218 -0.070632 0.0000143 0.8199981 1.2065864 -0.0000323 0.0362854 -0.0000809 1.3788416 0.0001338 0.154362 0.0001663 1.005849 -0.4505579 -0.1108259 -0.0754834 0.0013803 -0.367126 -0.0299225 0.0172784 -0.0159758 -0.3002668 -0.4106929 -0.0000748 0.1064736 -0.0000071 -0.3112294 0.0000678 0.0020784 0.0000526 -0.3872839 -0.4505671 0.1108907 -0.07535 -0.0014016 -0.3672018 0.0298182 0.0172934 0.015878 -0.3001968 -0.5190481 -0.0000791 0.1494115 -0.0000269 -0.2785642 0.0000607 0.0225407 0.0000439 -0.37799 0.1035665 0.0715365 -0.0205235 0.0724769 -0.0530154 0.06618 -0.0106431 0.0600749 0.0883929 -0.1413544 -0.046021 0.0079806 -0.1057393 0.0778346 -0.0200849 -0.0237293 -0.0212949 0.1078726 0.1122139 0.003846 0.0394241 0.0147048 0.1039559 -0.0297169 0.0329917 -0.0254011 -0.1220167 -0.1176648 -0.0000518 0.0613388 -0.0000992 0.1237298 0.0000554 0.1289064 0.0000542 0.0456444 0.0998086 0.0591043 -0.0410716 0.046466 -0.0119346 0.0871997 -0.0506443 0.0892664 0.0537133 0.0998093 -0.0590375 -0.0411476 -0.0463912 -0.0116933 -0.087298 -0.0507048 -0.0893689 0.0534607 0.1122193 -0.0038893 0.0393997 -0.0147443 0.1038853 0.0300116 0.0329446 0.0256958 -0.1219472 -0.1413487 0.046015 0.0080648 0.1057782 0.0777864 0.0200455 -0.0235709 0.021248 0.1079223 0.103577 -0.07152 -0.0206136 -0.0724773 -0.0528258 -0.0663565 -0.0107333 -0.060249 0.0882363 -0.0866687 -0.0000176 0.0099618 -0.0000482 0.1262955 0.0000169 0.0799826 0.0000229 0.0814089 0.1153666 -0.0361349 -0.019549 -0.0343822 -0.0059583 -0.0793042 -0.0404711 -0.097526 0.028362 0.1153567 0.0361697 -0.0195302 0.0344321 -0.0061018 0.079268 -0.0404527 0.097486 0.0285146 unknown
polarizability: 118.5330508|-0.0007143|117.1585062|0.9241296|0.0039774|106.5130877 unknown
InChI: InChI=1S/C3H9Si.CH3Cl2Si/c2*1-4(2)3/h1-3H3;1H3
charge 0 multiplicity 1
20 atoms
Cl 1.828731 1.796009 0.851528
Cl 1.828959 -1.795875 0.850079
Si -1.311789 0.00025 0.012735
Si 1.079301 0.00045 -0.22683
C  -1.966143 -1.585698 -0.834513
C  -1.656634 -0.001053 1.890102
C  -1.966162 1.587325 -0.832375
C  1.947991 0.001209 -1.910839
H  -1.512689 -2.485951 -0.38251
H  -3.063516 -1.658577 -0.713772
H  -1.74337 -1.593489 -1.916633
H  -2.745323 -0.001225 2.085639
H  -1.217324 -0.894528 2.36796
H  -1.217378 0.89177 2.369227
H  -1.743497 1.596525 -1.914505
H  -3.063518 1.66009 -0.711423
H  -1.512615 2.48696 -0.379237
H  3.043179 0.001223 -1.774448
H  1.669156 -0.89752 -2.489281
H  1.669041 0.900403 -2.488503
