program: Gaussian 09
title: 000170216
version: EM64L-G09RevD.01
frameworkgroup: C1[X(C9H12FN2O2)]
method: RPBEPBE
basis: SDD
operation: Freq
keyword: #p
keyword: freq=noraman
keyword: PBEPBE/SDD
title: #p freq=noraman PBEPBE/SDD
converged: YES YES NO NO
title: Mulliken charges:
elementType: F O O N N C C C C C C C C C H H H H H H H H H H H H
charge: -0.109009 -0.180771 -0.121214 -0.242977 0.035831 0.614417 -0.554341 -0.554291 -0.590106 -0.468660 -0.318823 0.217502 -0.349505 0.244709 0.285114 0.268554 0.273283 0.273249 0.268545 0.285114 0.283210 0.273343 0.283165 0.321487 0.260934 0.301240
chargesum: 1.00000
title: Mulliken charges with hydrogens summed into heavy atoms:
elementType: F O O N N C C C C C C C C C
charge: -0.109009 -0.180771 -0.121214 -0.242977 0.035831 0.614417 0.272609 0.272617 0.249612 -0.147172 -0.057889 0.217502 -0.048265 0.244709
polarizability: 1.55632428e+02 -6.96808976e-01 1.25181171e+02 -1.49579961e-03 -3.11907102e-04 6.58033511e+01
1716.lowfreq: -9.8291 -8.4692 0.0003 0.0006 0.0008 7.1181 23.2062 39.7502 89.7126
frequency: 23.1583 39.7144 89.7108 147.7536 152.6222 177.0986 241.8509 253.0578 254.5692 280.2735 327.3671 330.1470 371.6139 373.9860 379.4433 430.9791 444.0411 464.7646 518.7352 548.9378 572.1289 643.6887 682.9254 686.1260 726.5590 764.2002 806.5171 831.8808 876.2911 907.1563 928.7532 943.9233 962.1724 1042.5912 1052.9716 1099.0357 1105.0695 1122.0084 1165.2342 1178.9398 1210.7443 1217.1363 1231.0863 1253.0316 1263.1731 1379.6380 1395.6102 1419.3303 1422.8853 1423.7224 1452.5587 1455.1407 1460.5966 1466.0409 1478.9372 1485.4550 1489.9435 1501.1213 1593.1577 1619.7832 3031.6709 3032.7751 3035.8477 3147.8613 3149.5903 3154.7587 3155.1875 3155.5442 3161.7635 3165.7116 3180.3638 3187.2963
redmass: 14.7088 3.2418 5.1083 3.1006 5.5768 1.2060 1.5334 2.0472 3.8194 4.8448 4.2720 1.0627 12.0810 3.5811 2.8270 3.5680 3.4222 3.6943 3.7187 4.6467 4.0393 6.2254 5.6118 8.1896 5.2388 9.1423 3.9329 1.4782 5.2482 2.6386 2.7969 1.4342 1.3572 1.1915 2.7992 1.5270 1.2994 1.9756 1.4835 12.7643 1.8499 1.8754 2.5404 1.9863 1.6093 5.3128 8.5211 1.3842 1.1357 2.8810 1.0478 1.1639 1.0427 1.1251 1.1258 2.0596 1.0449 1.0613 8.7182 7.2722 1.0317 1.0319 1.0331 1.1060 1.1056 1.1046 1.0949 1.1059 1.1059 1.1027 1.0911 1.0966
irintensity: 0.1196 0.3883 0.0030 0.0000 3.5044 0.2477 0.8972 0.8981 0.3859 1.3358 1.2682 0.2208 1.5632 0.6043 1.1918 0.5365 0.0780 0.3071 2.1846 2.2412 26.4332 1.9661 2.2645 15.3213 2.9023 25.0237 41.7853 33.5229 7.1471 10.0451 17.4875 27.5876 3.2013 0.0306 44.7455 5.7555 0.3711 3.1071 14.6448 181.6170 0.1304 1.0811 6.1058 40.6071 6.7414 37.0560 17.7282 13.7781 19.3021 29.8998 0.1803 2.3287 2.0539 10.3714 50.0979 163.3557 36.8346 89.3559 12.0372 11.6897 1.2567 2.2072 1.2938 0.1117 0.5049 12.4045 0.6478 0.5891 0.6093 3.7441 18.5905 2.0973
temp: 298.150 k
press: 1.00000 atm
elementType: 9 8 8 7 7 6 6 6 6 6 6 6 6 6 1 1 1 1 1 1 1 1 1 1 1 1
symmnumber: 1
zpe: 536677.4 jmol-1
zpe.correction: 0.204410 hartree
zpe.thermalcorrener: 0.217979 hartree
zpe.thermalcorrenthalpy: 0.218924 hartree
zpe.thermalcorrgfe: 0.163554 hartree
zpe.sumelectzpe: -708.522219 hartree
zpe.sumelectthermal: -708.508649 hartree
zpe.sumelectthermalent: -708.507705 hartree
zpe.sumelectthermalfe: -708.563074 hartree
dipole: 14.2964 1.8790 -0.0006
dipole: 14.4193
quadrupole: -52.1157 -69.2730 -73.9379
quadrupole: -7.4082 0.0018 0.0030
quadrupole: 12.9932 -4.1641 -8.8291 -7.4082 0.0018 0.0030
hfenergy: -708.7266283 hartree
pointgroup: C01 [X(C9H12F1N2O2)]
dipole: -5.6418687 -0.593481 -0.0068938 debye
dipolederiv: -0.7363561 0.3518814 0.0008501 0.313777 -0.3375603 -0.000709 0.0006702 -0.0006871 -0.0863606 -0.5414063 -0.0250528 -0.0004108 0.041418 -0.7170524 -0.0018123 -0.0000184 -0.0022308 -0.2009641 -0.6640557 0.0735158 0.0000917 -0.0557762 -0.399898 -0.0010641 -0.0007953 -0.0007668 -0.1614503 -0.3388033 -0.0070768 -0.0001218 -0.0479088 -0.2920627 -0.0001587 -0.0000301 -0.0002132 -0.2571857 1.3508474 0.2484565 0.0017565 0.2872059 1.2723803 0.0044083 0.001852 0.0042842 0.1930437 0.5250079 -0.2344227 -0.0004647 -0.2534261 -0.0746732 -0.0000324 -0.0006748 0.0000412 -0.1174925 0.0801089 0.0447373 -0.1203699 0.0893086 0.0683886 -0.0710001 -0.1934628 -0.0552995 0.2545713 0.0799538 0.0439781 0.1204484 0.0880188 0.0676524 0.0700075 0.1937757 0.054201 0.2555837 0.0271059 0.0033427 0.0000163 -0.0587505 0.3202805 0.0006768 -0.0001864 0.0007821 0.0566824 0.0147845 0.1558899 0.0006444 -0.0108424 -0.1253149 -0.0002644 0.0000285 -0.0000414 -0.0657454 -0.0003268 -0.0002421 0.0000544 0.0048252 0.1009351 0.0007105 0.0000663 0.000694 -0.0828925 -0.3267293 -0.1993877 -0.0011267 -0.0984701 -0.316073 -0.0016125 -0.0005529 -0.001533 0.0740685 -0.3222358 0.1028158 0.0002252 -0.1312939 0.0789734 0.0005752 -0.0006455 0.0007296 -0.1051982 0.9790656 -0.5144046 -0.0013569 -0.2017025 0.4929303 0.0010893 -0.0000452 0.0009066 0.1620292 0.0746087 -0.0553239 -0.0642677 -0.0544398 0.0901285 -0.0481732 -0.0425096 -0.008827 0.0433024 -0.0318486 0.0524753 0.0107868 0.0886047 0.0938847 0.0224116 -0.0221752 0.0357277 0.0863169 0.1607666 0.0283831 0.020107 0.0037109 -0.0372457 0.0013723 0.0028743 -0.0492251 0.0859983 0.1608601 0.0285249 -0.019814 0.0037751 -0.0375567 -0.0021417 -0.0028156 0.0484693 0.0862727 -0.0318558 0.0525016 -0.0105309 0.0884875 0.0942748 -0.0223078 0.0227095 -0.0356296 0.0859678 0.0745865 -0.0557191 0.0639438 -0.0547333 0.0897401 0.0484228 0.042157 0.0091125 0.0437101 0.1057015 -0.0466355 0.0735799 -0.0111883 0.0841092 -0.0139881 0.0821816 0.0091438 0.013563 -0.0567107 0.0436936 0.0000067 -0.0335648 0.1036712 -0.0001055 -0.0002353 -0.0000515 0.1342834 0.1059202 -0.0462317 -0.0737694 -0.0107141 0.0840783 0.0144006 -0.0821057 -0.008811 0.0133856 0.2287433 0.0149515 0.0001316 0.0893675 0.113901 -0.0000853 0.0004041 -0.0001733 0.1568809 -0.0036579 -0.0663377 -0.0003561 -0.0785509 0.1093581 -0.0002228 -0.0003795 -0.0002177 0.1504746 0.0859256 0.0056871 -0.0000537 0.0028626 0.0727504 -0.000397 -0.000087 -0.0003849 0.181155 unknown
polarizability: 155.5759453|-1.4836995|125.2367517|0.0661088|0.224068|65.8042531 unknown
InChI: InChI=1S/C9H12FN2O2/c1-12(2,3)7-4-5-8(10)9(6-7)11(13)14/h4-6H,1-3H3
charge 1 multiplicity 1
26 atoms
F  2.742707 -1.826913 -0.004165
O  2.068849 2.38691 0.011612
O  3.612007 0.702222 0.006225
N  -2.543525 0.341633 -0.000078
N  2.410523 1.140972 0.006453
C  -1.117011 -0.198505 -0.001025
C  -3.281296 -0.153719 1.256334
C  -3.280351 -0.146421 -1.25989
C  -2.594332 1.873086 0.004342
C  -0.019175 0.671471 0.003008
C  -0.924558 -1.603542 -0.006039
C  1.290919 0.145306 0.002031
C  0.378689 -2.124367 -0.007007
C  1.490291 -1.25403 -0.00299
H  -2.739225 0.20097 2.145263
H  -4.305422 0.24948 1.244509
H  -3.314146 -1.251615 1.25608
H  -3.312626 -1.244302 -1.266371
H  -4.304681 0.256178 -1.246118
H  -2.7380 0.213986 -2.146345
H  -2.102015 2.263364 -0.898053
H  -3.652209 2.174868 0.004393
H  -2.103368 2.258071 0.909739
H  -0.087548 1.761966 0.007037
H  -1.762126 -2.307753 -0.009213
H  0.55613 -3.203313 -0.010833
