program: Gaussian 09
title: 000170170
version: EM64L-G09RevD.01
frameworkgroup: C1[X(C6H11N3S)]
method: RPBEPBE
basis: SDD
operation: Freq
keyword: #p
keyword: freq=noraman
keyword: PBEPBE/SDD
title: #p freq=noraman PBEPBE/SDD
converged: NO NO NO NO
title: Mulliken charges:
elementType: S N N N C C C C C C H H H H H H H H H H H
charge: 0.164648 -0.042473 -0.087016 -0.584037 0.234688 -0.683959 -0.680264 -0.680774 -0.169966 -0.121413 0.198231 0.230432 0.229990 0.229810 0.215254 0.214178 0.215297 0.229739 0.214141 0.333845 0.339649
chargesum: 0.00000
title: Mulliken charges with hydrogens summed into heavy atoms:
elementType: S N N N C C C C C C
charge: 0.164648 -0.042473 -0.087016 0.089458 0.234688 -0.025306 -0.021022 -0.021597 -0.169966 -0.121413
polarizability: 1.39897493e+02 -9.02542130e-02 9.98460297e+01 1.68803330e-02 2.18604166e-03 6.61635502e+01
1716.lowfreq: -18.4756 -0.0020 -0.0015 0.0013 3.4814 10.4630 22.1658 96.8035 160.3786
frequency: 21.1831 96.7676 160.3749 189.6126 213.6623 256.9806 258.3828 286.2854 289.2219 297.0626 349.2883 354.0741 412.3129 425.6977 473.0899 516.4644 546.6556 583.3542 591.0923 606.7001 731.1916 811.1473 925.6749 927.0682 936.6569 951.2619 982.4232 1022.6428 1031.5230 1098.9419 1205.3887 1216.4410 1237.0300 1274.4231 1375.0928 1378.7159 1402.9203 1450.7078 1461.3859 1462.7208 1472.3774 1473.8376 1477.6422 1503.0118 1530.0896 1616.9909 2977.0308 2979.6762 2991.4774 3074.2385 3079.3932 3083.8025 3087.0300 3092.5479 3105.1898 3560.5255 3714.8858
redmass: 4.7263 3.7564 3.6366 1.0594 2.8471 1.1377 1.1386 1.2644 2.5559 3.0870 2.2024 3.1608 3.9615 1.7028 1.9186 3.4960 4.9165 9.4512 6.5871 7.1540 7.6463 3.3766 1.7421 3.1534 1.7489 1.2040 3.1272 1.3867 1.4480 3.3428 2.8715 3.1355 2.7354 3.5398 1.1829 1.1884 1.2370 1.0487 1.0802 1.0480 1.0508 1.8442 1.1622 1.5809 3.9359 1.3504 1.0345 1.0348 1.0359 1.1004 1.0997 1.1010 1.1002 1.0993 1.1000 1.0456 1.1041
irintensity: 1.1670 6.0893 4.8333 0.1858 0.8270 0.9641 1.1928 63.5108 5.7677 4.0005 12.8428 3.4861 4.4454 158.8991 91.6701 0.2697 23.3580 15.8440 3.8568 0.0975 14.4650 3.7502 1.9334 22.8324 19.6837 0.1499 34.7263 0.0942 4.8811 45.4601 8.8440 4.7079 5.4716 59.0426 19.2739 21.8955 7.8835 0.1226 0.1430 1.2740 11.7810 0.2123 22.1811 48.7186 175.8174 287.6681 24.7188 23.6835 31.1735 0.3326 60.5940 14.1722 11.8904 66.5290 28.9939 118.8903 55.0906
temp: 298.150 k
press: 1.00000 atm
elementType: 16 7 7 7 6 6 6 6 6 6 1 1 1 1 1 1 1 1 1 1 1
symmnumber: 1
zpe: 440413.4 jmol-1
zpe.correction: 0.167745 hartree
zpe.thermalcorrener: 0.179270 hartree
zpe.thermalcorrenthalpy: 0.180214 hartree
zpe.thermalcorrgfe: 0.130477 hartree
zpe.sumelectzpe: -796.749236 hartree
zpe.sumelectthermal: -796.737711 hartree
zpe.sumelectthermalent: -796.736767 hartree
zpe.sumelectthermalfe: -796.786504 hartree
dipole: 1.2012 -3.2090 0.0050
dipole: 3.4265
quadrupole: -47.5385 -74.7018 -69.7491
quadrupole: -4.7427 0.0153 0.0053
quadrupole: 16.4580 -10.7053 -5.7527 -4.7427 0.0153 0.0053
hfenergy: -796.9169807 hartree
pointgroup: C01 [X(C6H11N3S1)]
dipole: 0.3884508 -1.2907145 -0.0214588 debye
dipolederiv: -0.5297281 0.0870539 0.0064016 -0.0647707 -0.6002054 -0.009716 0.0041984 -0.0110039 0.0523339 0.2094801 0.2078652 -0.0002313 -0.0169289 -0.5072212 -0.0058709 -0.0029196 -0.0069983 -0.1409981 -0.7925763 -0.2221714 0.0018631 0.5929433 -0.5006955 -0.0100986 0.0129168 -0.0021895 -0.2004153 -1.541664 0.2993817 0.0113172 0.3300638 -0.2526502 0.0039165 0.0123175 0.0042909 -0.7013128 0.1549836 -0.0177294 -0.0004572 0.04948 -0.0009648 -0.0024109 0.0022685 -0.0014691 0.153011 0.0134511 0.051131 0.0007203 -0.0440075 -0.0158291 0.0000575 -0.0005162 -0.0008906 0.0269069 -0.049772 -0.0079523 0.014157 0.0019334 0.0061119 0.047343 -0.0454818 0.045668 -0.0180488 -0.0478988 -0.0086755 -0.0132109 -0.0008074 0.0073362 -0.0476349 0.0447114 -0.0454351 -0.0204399 0.5067749 -0.2367892 -0.0103638 -0.4494734 0.6563069 0.0162195 -0.012507 0.0134038 -0.1385531 1.7061913 -0.1024474 -0.0137611 -0.3794697 0.7197627 0.0135545 -0.0187103 0.0100626 0.1075401 -0.2140133 0.017484 0.0027954 -0.0375733 0.0654716 0.0000546 0.0021568 -0.000252 0.0968672 0.0987976 -0.0427675 -0.061974 -0.0044109 0.0190477 -0.0797131 -0.0386545 -0.1031514 -0.0651071 0.0997514 -0.0417477 0.05877 -0.0036404 0.016082 0.0811521 0.0360644 0.1053259 -0.0648163 0.0914412 -0.0386857 -0.0641296 -0.0239072 0.0308076 -0.1098038 -0.0442046 -0.0589504 -0.0919783 -0.2114029 -0.0415056 0.0322282 -0.0311987 0.0975555 0.0160151 0.0108685 0.0085983 0.0780079 0.0646976 0.1133826 0.0005743 0.0931763 -0.1098107 0.0312058 0.010015 -0.0221521 0.0674383 -0.211953 -0.0413294 -0.0280082 -0.0303797 0.0982277 -0.0148447 -0.0058776 -0.0074151 0.078736 0.0930356 -0.038479 0.0605911 -0.022844 0.028172 0.1117764 0.0407779 0.0615425 -0.0914804 0.0640689 0.1140516 0.0011034 0.0935274 -0.1092279 -0.0347083 -0.0090669 0.0175384 0.067343 0.2395925 -0.0615576 0.0003419 -0.103402 0.1863906 -0.002445 -0.0002941 -0.0028339 0.4028816 0.2567426 0.0114876 0.0012723 0.0516895 0.1653325 -0.0040489 0.0019373 -0.0036889 0.4020842 unknown
polarizability: 139.7068345|-2.7101241|100.0225079|-0.6638626|0.5503327|66.1777303 unknown
InChI: InChI=1S/C6H11N3S/c1-6(2,3)4-8-9-5(7)10-4/h7H2,1-3H3
charge 0 multiplicity 1
21 atoms
S  0.871021 -1.434531 -0.032214
N  0.422195 1.20786 0.012631
N  1.821335 1.085313 -0.000469
N  3.545005 -0.566343 -0.038933
C  -1.761406 -0.085186 0.013551
C  -2.4184 1.321311 0.028816
C  -2.192678 -0.876498 1.283751
C  -2.21391 -0.858131 -1.260454
C  -0.251343 0.072598 0.002693
C  2.223912 -0.190817 -0.02258
H  -3.518261 1.208856 0.036908
H  -2.110196 1.893657 0.919873
H  -2.124884 1.906006 -0.859241
H  -1.87342 -0.352144 2.201841
H  -3.293472 -0.975672 1.303381
H  -1.755197 -1.891596 1.296381
H  -3.314916 -0.956709 -1.26339
H  -1.909563 -0.320811 -2.17609
H  -1.777404 -1.873174 -1.294723
H  3.830859 -1.539459 -0.055963
H  4.247821 0.170073 -0.033168
