program: Gaussian 09
title: 000170162
version: EM64L-G09RevD.01
frameworkgroup: C1[X(C6H9NOS2)]
method: RPBEPBE
basis: SDD
operation: Freq
keyword: #p
keyword: freq=noraman
keyword: PBEPBE/SDD
title: #p freq=noraman PBEPBE/SDD
converged: NO YES NO NO
title: Mulliken charges:
elementType: S S O N C C C C C C H H H H H H H H H
charge: 0.311305 0.123260 -0.203820 -0.052507 -0.340447 -0.341425 0.295551 -0.782964 -0.533930 -0.677844 0.243215 0.242774 0.226993 0.221407 0.305878 0.303968 0.217587 0.225766 0.215234
chargesum: 0.00000
title: Mulliken charges with hydrogens summed into heavy atoms:
elementType: S S O N C C C C C C
charge: 0.311305 0.123260 -0.203820 -0.052507 0.145541 0.106974 0.295551 -0.173118 -0.533930 -0.019257
polarizability: 1.21262287e+02 8.58749848e+00 1.40588815e+02 -7.50241218e+00 -1.64446572e+00 6.20149922e+01
1716.lowfreq: -10.5355 -6.6271 -5.7360 0.0004 0.0019 0.0027 49.7348 67.6955 81.0856
frequency: 49.6990 67.6908 81.0708 119.7245 132.3694 215.7073 242.9557 288.3462 322.1951 347.9185 395.9394 488.3354 510.1897 521.9267 587.4153 634.3148 718.5827 743.3615 816.1142 873.0856 890.5944 898.3925 971.9650 1048.9908 1078.4009 1112.2154 1116.4343 1134.6122 1221.7232 1223.8319 1277.6726 1291.9147 1307.1697 1341.0797 1369.5969 1393.6988 1422.8765 1444.3496 1473.4221 1478.9188 1484.4787 1634.8251 2980.2740 2999.7272 3021.9366 3049.2029 3049.4680 3076.9689 3084.5372 3096.8114 3121.8271
redmass: 4.0193 7.7847 1.6799 3.4645 4.3117 1.1806 5.4924 3.4084 3.0243 6.0318 17.3383 6.3223 15.9371 5.4665 4.1753 5.1777 4.8322 1.1734 2.7596 1.5718 1.6305 1.8420 4.1662 3.3203 7.2262 2.2075 1.1780 2.0758 1.9234 1.3689 2.0940 1.8151 1.4392 1.5758 1.4497 1.2062 1.0802 1.1062 1.0608 1.0416 1.0718 11.3817 1.0359 1.0598 1.0582 1.1008 1.0575 1.1021 1.0989 1.1062 1.1067
irintensity: 0.3746 2.4501 0.0463 10.0745 0.1610 0.1642 3.0095 0.7755 2.8765 7.8357 4.5785 18.0194 4.8955 3.6232 5.5988 11.2290 11.9064 8.2768 9.7245 14.2517 7.0984 8.3481 34.6774 1.2892 11.9832 5.7628 2.6222 140.0948 158.6292 66.0899 92.1483 56.5760 19.1528 153.6540 35.4571 10.4955 12.8426 38.5119 2.4646 10.7100 17.2890 247.1646 31.4617 10.0079 24.2713 0.0515 3.9801 30.6166 37.2962 12.9506 0.0554
temp: 298.150 k
press: 1.00000 atm
elementType: 16 16 8 7 6 6 6 6 6 6 1 1 1 1 1 1 1 1 1
symmnumber: 1
zpe: 378348.1 jmol-1
zpe.correction: 0.144105 hartree
zpe.thermalcorrener: 0.154956 hartree
zpe.thermalcorrenthalpy: 0.155900 hartree
zpe.thermalcorrgfe: 0.106210 hartree
zpe.sumelectzpe: -1159.386227 hartree
zpe.sumelectthermal: -1159.375376 hartree
zpe.sumelectthermalent: -1159.374432 hartree
zpe.sumelectthermalfe: -1159.424122 hartree
dipole: 0.1798 -1.4924 0.2747
dipole: 1.5281
quadrupole: -67.8147 -86.7056 -73.4314
quadrupole: 7.5740 -0.3644 -1.4454
quadrupole: 8.1691 -10.7217 2.5525 7.5740 -0.3644 -1.4454
hfenergy: -1159.5303318 hartree
pointgroup: C01 [X(C6H9N1O1S2)]
dipole: -0.0098987 -0.5906912 -0.1114567 debye
dipolederiv: -0.5315307 0.1877802 0.1160378 0.1880796 -0.0657266 -0.0452797 0.1491766 -0.0486909 -0.0047192 -0.4068492 0.2811651 0.0616691 0.2527574 -0.7597538 -0.0679179 0.0615994 -0.0654511 -0.1290065 -0.5038154 -0.3417877 0.048245 -0.0444556 -1.2175848 0.0660187 0.0337289 0.1191889 -0.3372435 -0.8518424 0.1481234 0.1011029 -0.1734945 -1.7376292 0.0723391 0.1296946 0.0051741 -0.1251589 0.4941131 0.0806456 -0.020335 -0.0115921 0.0970887 0.0136635 -0.0588227 -0.0321669 0.1963737 0.0100591 -0.0144653 0.0360242 -0.0066776 0.112478 0.0057682 0.0747128 0.0385043 0.0335154 0.753868 -0.171046 -0.1238224 -0.1727772 1.7587694 -0.0530298 -0.112328 0.0042397 0.2256986 -0.4369685 -0.0207633 0.1319502 0.0525716 0.1883775 -0.0165838 0.141443 0.0075264 0.0741381 1.1229857 -0.1161834 -0.3116103 -0.1719253 1.6220607 0.0568365 -0.3377197 -0.0153166 -0.1111099 -0.0439908 -0.0041705 0.0062089 -0.0014291 0.1000628 -0.0046074 -0.0714333 -0.0204233 0.0573217 0.0443788 0.0000432 -0.0078603 0.0678449 0.0197936 -0.1218935 -0.0153012 -0.0412261 0.0349276 0.0308848 0.0003818 -0.0084145 -0.0517217 0.0048389 0.1104169 -0.012516 0.0397557 0.0379893 0.0398541 -0.0520489 0.0342207 -0.0251169 -0.0386851 0.1147955 0.0333602 0.0575855 0.0014691 0.0153285 0.0694944 0.0348689 0.0380632 -0.037786 -0.11711 0.0203798 -0.0681121 -0.0032678 0.0870766 -0.0055726 -0.0402337 0.0404452 0.0030404 0.0387255 -0.0636711 0.0574734 0.0612152 0.1250917 -0.0329557 0.0045168 0.0200633 -0.0074874 -0.0533247 0.0302399 -0.0457636 0.0287078 0.0624325 0.0070087 0.024233 0.0665331 -0.0716287 -0.1176423 0.0688561 -0.1031927 0.0148252 -0.0704342 -0.0129853 -0.1068718 -0.0041504 0.1025071 -0.0029329 -0.1429396 -0.0049825 -0.0659279 0.0593583 -0.0026637 0.0200705 -0.063018 -0.0727354 0.121758 0.0715403 0.1158779 0.010252 unknown
polarizability: 122.8699548|-10.3779586|138.5040678|-9.3557747|1.5749305|62.4920711 unknown
InChI: InChI=1S/C6H9NOS2/c1-2-3-7-5(8)4-10-6(7)9/h2-4H2,1H3
charge 0 multiplicity 1
19 atoms
S  2.558823 0.885242 -0.406292
S  0.169074 2.750309 0.184637
O  0.343734 -2.355716 0.268752
N  0.140284 -0.007695 0.269739
C  -1.300994 -0.05214 0.629891
C  -2.21327 -0.064465 -0.61733
C  0.853468 -1.220619 0.102619
C  2.310957 -0.981356 -0.282334
C  0.812802 1.20226 0.050105
C  -3.701144 -0.090916 -0.208754
H  -1.510324 0.835539 1.252141
H  -1.449996 -0.970799 1.223774
H  -2.004131 0.8341 -1.226732
H  -1.97398 -0.951904 -1.232599
H  2.977005 -1.398965 0.488754
H  2.527404 -1.455934 -1.252067
H  -3.96919 0.804053 0.382943
H  -4.352009 -0.111236 -1.100611
H  -3.934913 -0.985057 0.398764
