program: Gaussian 09
title: 000170155
version: EM64L-G09RevD.01
frameworkgroup: C1[X(C14H10F3NO3)]
method: RPBEPBE
basis: SDD
operation: Freq
keyword: #p
keyword: freq=noraman
keyword: PBEPBE/SDD
title: #p freq=noraman PBEPBE/SDD
converged: YES YES NO NO
title: Mulliken charges:
elementType: F F F O O O N C C C C C C C C C C C C C C H H H H H H H H H H
charge: -0.173221 -0.157784 -0.156279 -0.405613 -0.433307 -0.324929 -0.518698 0.496466 0.323455 0.188702 -0.517973 -0.427136 0.187108 0.049483 -0.340723 -0.364570 0.269161 -0.297798 -0.218653 -0.255530 0.149114 0.369271 0.307244 0.254354 0.229459 0.269581 0.275227 0.233264 0.236347 0.366755 0.387223
chargesum: 0.00000
title: Mulliken charges with hydrogens summed into heavy atoms:
elementType: F F F O O O N C C C C C C C C C C C C C C
charge: -0.173221 -0.157784 -0.156279 -0.038857 -0.046085 -0.324929 -0.149427 0.496466 0.323455 0.188702 -0.210729 -0.172781 0.187108 0.049483 -0.111264 -0.094989 0.269161 -0.022571 0.014611 -0.019183 0.149114
polarizability: 2.88805570e+02 2.77414755e+01 1.97808646e+02 1.74721056e+01 -5.36272139e+00 8.96408047e+01
1716.lowfreq: -2.7618 -0.0009 -0.0006 -0.0005 3.3502 4.5520 24.4210 31.8777 46.8360
frequency: 24.4021 31.8440 46.8272 61.7938 97.4320 109.3822 128.0137 158.0000 166.7299 194.1715 224.3071 272.4640 284.8664 303.1264 317.2490 327.7060 341.4398 373.9279 399.5384 422.0954 430.9190 438.8975 485.6745 501.5295 519.0480 524.5737 554.7386 571.7766 585.3500 607.0910 621.5872 639.3158 681.7004 696.9162 728.2080 741.0368 750.9576 772.9972 786.7579 803.6613 823.9033 842.6598 865.8405 910.1650 921.0796 940.3901 974.4972 989.8340 993.9864 1001.7087 1011.9355 1035.0192 1045.3538 1101.4983 1114.2442 1164.1423 1167.1797 1179.9164 1209.0018 1252.8005 1262.9214 1274.8251 1296.8014 1322.1283 1347.0527 1388.6230 1402.3726 1431.7152 1444.8624 1460.1706 1498.9418 1527.3463 1580.0069 1596.0343 1615.4770 1634.2066 1643.9261 3126.8358 3137.2517 3154.3539 3159.3179 3174.9045 3182.8168 3188.3992 3242.3542 3533.6874 3587.6596
redmass: 7.5494 9.8466 8.6498 7.6113 9.7142 5.4369 5.7908 6.8657 7.7848 8.9550 5.6886 6.6100 6.7338 5.0775 11.2686 1.2094 7.0159 5.6721 8.4325 3.3336 5.1275 7.5319 8.0221 4.5117 3.1778 6.7907 7.0073 1.1974 5.1329 5.4263 8.0444 5.8802 4.3178 7.3236 4.6648 3.5484 3.3268 1.5485 4.2312 1.4771 1.5059 5.2221 1.4749 5.5105 1.3969 1.3714 1.3763 4.5634 1.4784 7.9873 5.2990 4.2064 2.3255 1.7562 1.8433 1.3023 1.4414 1.0967 2.2069 1.7985 2.9091 3.2172 1.3554 2.1311 2.5772 8.5389 6.9547 4.5404 2.9517 2.4998 2.7929 3.6786 7.0453 5.2142 3.9120 6.7877 2.6760 1.0886 1.0872 1.0964 1.0902 1.0938 1.0984 1.0924 1.0802 1.0641 1.0664
irintensity: 1.2542 0.0779 0.6559 1.2117 0.3035 2.1569 0.5547 1.1367 1.0172 0.1555 0.8583 5.9840 3.3707 17.9494 0.6805 119.5010 5.5083 2.6853 12.9161 14.8576 0.9688 8.5088 34.2249 16.4638 13.0893 4.5141 9.5978 119.8364 10.1939 63.9157 18.7145 7.7420 39.7996 6.2500 0.7880 5.2832 26.9850 94.4216 30.2394 16.2014 120.0155 10.4339 10.3787 34.0482 36.4635 2.5598 0.9316 94.2617 21.7003 208.0737 344.6053 28.0098 25.8904 235.6039 252.6303 149.4537 28.1109 1.6714 95.2545 38.3972 121.5936 104.0788 42.3908 77.3556 157.4246 29.4924 50.4837 81.1158 30.2330 320.3117 51.6258 427.2514 134.7007 63.2153 234.9733 6.0513 174.1649 17.9899 6.2292 4.9834 10.8841 9.2203 9.5896 1.4445 217.3323 74.1741 82.2451
temp: 298.150 k
press: 1.00000 atm
elementType: 9 9 9 8 8 8 7 6 6 6 6 6 6 6 6 6 6 6 6 6 6 1 1 1 1 1 1 1 1 1 1
symmnumber: 1
zpe: 565165.0 jmol-1
zpe.correction: 0.215260 hartree
zpe.thermalcorrener: 0.233412 hartree
zpe.thermalcorrenthalpy: 0.234356 hartree
zpe.thermalcorrgfe: 0.167739 hartree
zpe.sumelectzpe: -1117.974341 hartree
zpe.sumelectthermal: -1117.956189 hartree
zpe.sumelectthermalent: -1117.955245 hartree
zpe.sumelectthermalfe: -1118.021862 hartree
dipole: 2.6942 -3.3554 -1.9592
dipole: 4.7282
quadrupole: -118.2568 -105.0022 -122.2656
quadrupole: 17.2243 9.1200 1.0317
quadrupole: -3.0820 10.1727 -7.0907 17.2243 9.1200 1.0317
hfenergy: -1118.1896008 hartree
pointgroup: C01 [X(C14H10F3N1O3)]
dipole: -0.9961965 1.3704759 -0.7679742 debye
polarizability: 291.0328302|22.3493832|195.0808554|-20.6040795|4.9740408|90.1413348 unknown
InChI: InChI=1S/C14H10F3NO3/c15-14(16,17)10-7-8(5-6-12(10)19)18-11-4-2-1-3-9(11)13(20)21/h1-7,18-20H
charge 0 multiplicity 1
31 atoms
F  2.681765 -2.307404 0.898994
F  4.261313 -1.757593 -0.624914
F  4.365501 -0.909606 1.47508
O  4.625928 1.150176 -0.58447
O  -5.102083 1.390302 0.945899
O  -3.066514 2.431235 0.613385
N  -1.019749 0.932542 -0.191487
C  0.391426 0.937434 -0.312829
C  -1.908653 -0.135447 -0.297218
C  2.62134 -0.059683 -0.007613
C  1.216525 -0.141276 0.095505
C  1.015654 2.121119 -0.793503
C  3.231885 1.125027 -0.499907
C  -3.294736 0.055733 0.079244
C  2.41531 2.217031 -0.876455
C  -1.526407 -1.41421 -0.80892
C  3.469312 -1.223898 0.42389
C  -4.213346 -1.027986 -0.025468
C  -2.457903 -2.458615 -0.907211
C  -3.808335 -2.281915 -0.502541
C  -3.761783 1.364297 0.54925
H  -1.482363 1.829664 0.052205
H  0.775854 -1.038789 0.534052
H  0.392984 2.966175 -1.106491
H  2.876156 3.139795 -1.249669
H  -0.506238 -1.572359 -1.165529
H  -5.250061 -0.850543 0.273024
H  -2.132093 -3.422726 -1.313796
H  -4.523082 -3.106708 -0.576331
H  4.951462 2.015477 -0.935598
H  -5.323769 2.314351 1.239018
