program: Gaussian 09
title: 000170141
version: EM64L-G09RevD.01
frameworkgroup: C1[X(C16H16O2S2)]
method: RPBEPBE
basis: SDD
operation: Freq
keyword: #p
keyword: freq=noraman
keyword: PBEPBE/SDD
title: #p freq=noraman PBEPBE/SDD
converged: YES YES NO NO
title: Mulliken charges:
elementType: S S O O C C C C C C C C C C C C C C C C H H H H H H H H H H H H H H H H
charge: -0.037580 -0.037070 -0.263387 -0.263438 0.362566 0.360550 -0.274090 -0.275227 -0.361394 -0.360064 -0.353568 -0.353308 0.317747 0.317774 -0.349892 -0.349834 -0.353454 -0.353258 -0.538053 -0.538019 0.279546 0.279247 0.256442 0.256417 0.253210 0.253223 0.240549 0.240514 0.129623 0.129575 0.221842 0.223668 0.246824 0.246821 0.221791 0.223703
chargesum: 0.00000
title: Mulliken charges with hydrogens summed into heavy atoms:
elementType: S S O O C C C C C C C C C C C C C C C C
charge: 0.092043 0.092506 -0.263387 -0.263438 0.362566 0.360550 -0.274090 -0.275227 -0.081848 -0.080817 -0.097125 -0.096891 0.317747 0.317774 -0.096682 -0.096611 -0.112906 -0.112743 0.154282 0.154296
polarizability: 4.12660410e+02 -3.11019853e+00 1.78025858e+02 1.65345151e-02 2.57673266e-02 1.42655008e+02
1716.lowfreq: -0.0023 -0.0006 -0.0005 4.4290 5.3970 14.3468 24.5980 32.1130 51.5359
frequency: 24.5887 32.0887 51.5356 61.8710 69.9664 95.1000 112.0129 139.7220 140.6554 172.6460 174.4130 188.2468 207.3150 242.6715 250.0021 259.6857 270.3868 284.2141 296.5218 326.9976 357.9276 379.6847 414.6430 416.7056 433.7613 434.8383 475.9151 507.2433 522.1703 536.6118 576.5759 596.8049 629.2610 632.6733 698.4818 725.6209 726.8652 757.9180 764.9745 812.3130 817.0845 823.2437 830.7574 842.8952 852.5177 912.4154 939.4943 950.6991 953.4910 975.9651 977.3486 985.9742 986.2927 1002.9360 1005.0819 1112.5129 1112.5457 1114.2739 1114.4414 1157.4061 1157.5489 1179.0487 1179.9238 1199.2405 1231.0586 1234.4643 1256.2265 1302.6706 1303.1324 1357.4038 1360.5750 1421.3967 1421.5465 1436.0707 1436.7182 1468.5898 1468.6290 1472.5979 1472.8495 1489.7252 1498.5528 1567.5209 1567.9976 1593.3284 1614.5342 1616.9770 2427.6854 2428.4450 2961.8368 2962.0356 3050.5152 3050.5416 3127.4044 3127.4424 3141.9185 3142.0015 3146.9248 3146.9889 3165.1083 3165.2029 3170.7174 3170.8342
redmass: 5.4707 4.8871 3.8108 5.4020 5.0513 3.8968 4.5876 4.5011 6.9965 5.9375 4.3736 3.9601 2.3479 1.4249 1.5585 3.0337 2.8378 1.2268 1.2265 4.5927 5.8739 6.6603 3.0098 2.9753 5.7810 4.9453 4.7181 4.1083 3.4981 2.6595 5.4106 5.9101 5.5865 6.9705 4.0828 3.8484 4.0353 5.7693 5.2599 2.1102 1.3773 1.7344 1.3557 1.6085 1.3999 1.5909 2.4726 1.3619 1.6832 1.3298 1.3570 8.7842 8.6401 2.5547 2.4929 1.2619 1.2614 1.3682 1.3632 1.3305 1.3279 1.2678 1.3357 3.3748 2.5513 3.1758 4.7839 1.2954 1.2771 5.0199 5.5578 4.0210 3.9923 1.1726 1.1723 1.0497 1.0497 1.0801 1.0905 2.2678 2.4635 7.4390 7.1002 10.2230 6.2612 6.2883 1.0374 1.0374 1.0328 1.0329 1.1040 1.1040 1.0995 1.0995 1.0880 1.0881 1.0882 1.0882 1.0951 1.0951 1.0971 1.0971
irintensity: 0.7643 1.1740 0.2393 0.0523 0.4640 4.1573 3.2371 3.5009 0.2966 3.7947 1.4059 3.1930 2.6185 1.0798 1.1850 0.1029 8.5810 18.3596 20.7796 8.9445 1.4792 2.1695 0.8875 0.6649 1.3033 5.4579 4.9876 33.4924 12.6660 10.2790 1.6025 1.2684 8.2850 0.0078 30.5810 0.0203 6.5381 28.0783 2.3564 55.2983 15.5685 1.2009 2.8601 48.5445 44.1586 15.3351 0.0446 4.2400 0.4530 0.1827 0.1413 87.6695 15.1618 25.9380 1.9008 0.2819 0.3131 11.8371 8.4847 3.6603 0.3758 275.6431 1.8848 0.6049 356.5199 1.9699 127.1027 1.9288 1.4959 28.7689 3.6785 8.8892 6.2128 5.3644 19.9369 13.9090 13.7168 138.7419 4.4437 0.0058 228.5690 2.6038 34.8896 0.2771 0.0424 206.7336 15.1732 7.7369 131.8643 34.6862 44.8901 47.5730 49.7915 7.8419 9.2826 3.4215 9.0025 1.6973 15.9171 14.2604 7.5368 1.5606
temp: 298.150 k
press: 1.00000 atm
elementType: 16 16 8 8 6 6 6 6 6 6 6 6 6 6 6 6 6 6 6 6 1 1 1 1 1 1 1 1 1 1 1 1 1 1 1 1
symmnumber: 1
zpe: 711556.4 jmol-1
zpe.correction: 0.271018 hartree
zpe.thermalcorrener: 0.291328 hartree
zpe.thermalcorrenthalpy: 0.292272 hartree
zpe.thermalcorrgfe: 0.221068 hartree
zpe.sumelectzpe: -1564.371548 hartree
zpe.sumelectthermal: -1564.351237 hartree
zpe.sumelectthermalent: -1564.350293 hartree
zpe.sumelectthermalfe: -1564.421498 hartree
dipole: 0.0013 -0.0035 -2.8789
dipole: 2.8789
quadrupole: -88.5442 -137.6467 -129.6958
quadrupole: -7.1895 0.0301 0.0165
quadrupole: 30.0847 -19.0178 -11.0669 -7.1895 0.0301 0.0165
hfenergy: -1564.6425654 hartree
pointgroup: C01 [X(C16H16O2S2)]
dipole: 0.0012319 -1.1320564 -0.0364631 debye
polarizability: 412.6822038|0.2485722|142.696366|-2.1217377|-1.2070319|177.962706 unknown
InChI: InChI=1S/C16H16O2S2/c1-17-13-7-3-11(4-8-13)15(19)16(20)12-5-9-14(18-2)10-6-12/h3-10,19-20H,1-2H3
charge 0 multiplicity 1
36 atoms
S  0.155178 -0.456766 2.278939
S  -0.154056 -0.306462 -2.296424
O  6.116992 0.362588 -0.563653
O  -6.113555 0.319442 0.593613
C  1.965172 -0.128541 0.200867
C  -1.961532 -0.11889 -0.200194
C  0.504622 -0.237002 0.46459
C  -0.500774 -0.207155 -0.4717
C  2.478898 0.93186 -0.605925
C  -2.476204 0.889769 0.66975
C  2.893986 -1.033693 0.77713
C  -2.888867 -0.989612 -0.82899
C  4.766034 0.138727 -0.26632
C  -4.76228 0.115191 0.283736
C  3.85628 1.065715 -0.838662
C  -3.853618 1.007163 0.910963
C  4.281887 -0.914924 0.548226
C  -4.276889 -0.887044 -0.592584
C  7.099763 -0.560303 0.011015
C  -7.09551 -0.56717 -0.036868
H  1.784873 1.659408 -1.038892
H  -1.782288 1.589594 1.146388
H  2.521086 -1.84341 1.413395
H  -2.515137 -1.758847 -1.513204
H  4.253869 1.882404 -1.448807
H  -4.252233 1.784442 1.569963
H  4.964417 -1.637271 1.005672
H  -4.958212 -1.581887 -1.092522
H  -1.143215 -0.924356 2.149682
H  1.145413 -0.779183 -2.200392
H  6.93027 -1.596969 -0.339424
H  7.077142 -0.5334 1.117713
H  8.074878 -0.201373 -0.349067
H  -8.071002 -0.231834 0.344325
H  -6.925319 -1.623277 0.249183
H  -7.072667 -0.472231 -1.139822
