program: Gaussian 09
title: 000013130
version: EM64L-G09RevD.01
frameworkgroup: C1[X(CH5O4P)]
method: RPBEPBE
basis: SDD
operation: Freq
keyword: #pfreq=noraman
keyword: PBEPBE/SDD
title: #p freq=noraman PBEPBE/SDD
converged: YES YES NO NO
title: Mulliken charges:
elementType: P O O O O C H H H H H
charge: 1.398559 -0.508608 -0.679213 -0.678698 -0.606310 -0.474779 0.244018 0.249632 0.250011 0.402806 0.402583
chargesum: 0.00000
title: Mulliken charges with hydrogens summed into heavy atoms:
elementType: P O O O O C
charge: 1.398559 -0.508608 -0.276407 -0.276115 -0.606310 0.268882
polarizability: 5.64685345e+01 2.86693199e-02 4.27200252e+01 2.85374174e+00 4.03697499e-02 4.04185640e+01
1716.lowfreq: -223.3960 -7.7702 -0.0007 0.0011 0.0019 8.6393 11.1042 79.9625 100.7493
frequency: -223.3877 79.9071 100.7027 154.5855 194.6360 272.8328 273.6606 337.1570 354.8532 409.5765 608.4479 713.0631 719.5310 968.3220 985.8534 989.1490 1097.9345 1116.7833 1134.6375 1426.3851 1460.5607 1475.3989 2999.7400 3108.9755 3141.0088 3611.2242 3614.0013
redmass: 1.2596 3.4141 2.1615 1.0535 2.4269 4.4240 2.9073 5.0248 8.5845 4.9747 10.4995 9.8118 7.2001 6.2891 1.2512 1.6440 4.3578 1.2365 1.2998 1.1231 1.0497 1.0548 1.0283 1.1063 1.1049 1.0662 1.0670
irintensity: 65.9931 14.0076 152.9838 0.3443 25.7305 32.6988 93.7729 3.9226 34.8895 1.9578 6.2756 214.9101 333.6956 110.6534 10.5303 30.6789 260.4901 0.1966 7.7466 3.9579 13.3032 15.0864 35.2014 21.6957 10.9516 104.0888 47.2569
temp: 298.150 k
press: 1.00000 atm
elementType: 15 8 8 8 8 6 1 1 1 1 1
symmnumber: 1
zpe: 187508.2 jmol-1
zpe.correction: 0.071418 hartree
zpe.thermalcorrener: 0.079479 hartree
zpe.thermalcorrenthalpy: 0.080423 hartree
zpe.thermalcorrgfe: 0.038901 hartree
zpe.sumelectzpe: -682.699204 hartree
zpe.sumelectthermal: -682.691143 hartree
zpe.sumelectthermalent: -682.690199 hartree
zpe.sumelectthermalfe: -682.731721 hartree
dipole: 0.9397 -0.0214 2.4452
dipole: 2.6196
quadrupole: -38.0516 -36.6597 -49.5315
quadrupole: -0.0381 -6.0792 0.0573
quadrupole: 3.3627 4.7546 -8.1172 -0.0381 -6.0792 0.0573
hfenergy: -682.7706219 hartree
pointgroup: C01 [X(C1H5O4P1)]
dipole: -0.4161774 -0.9353333 0.1190321 debye
dipolederiv: 2.0949386 -0.0150059 0.0030169 -0.404275 1.7375706 0.0448823 0.0462073 0.0499326 2.1543924 -1.4015461 -0.0459375 0.0013318 -0.0927372 -0.4472638 -0.013653 0.008106 -0.0133993 -0.5658493 -0.5088295 0.0633487 -0.088196 0.1716098 -0.8994835 -0.2834217 0.0344721 -0.250108 -0.9330033 -0.5168714 0.0891833 0.076038 0.1658153 -0.773534 0.2527845 -0.0671635 0.2171063 -1.0514572 -0.6977007 -0.0740682 0.0087335 0.0166278 -0.6447137 -0.0016845 -0.0026594 -0.0025398 -0.6636162 0.6903112 0.0761394 -0.007152 0.342328 0.201451 0.0104148 -0.0383661 0.0094329 0.2783478 -0.0821023 0.0834965 -0.0094465 0.0719837 0.0094011 0.0128519 -0.0079071 0.0128601 0.1275742 0.0348104 -0.0150522 -0.0092076 -0.0885005 0.0589199 0.0815403 0.0506672 0.0855939 -0.0650817 0.0342576 -0.0128297 0.0116825 -0.0974572 0.0175828 -0.1004735 -0.0301394 -0.1040216 -0.0235303 0.1729294 -0.0669408 0.0448413 -0.0303226 0.3717535 -0.0057466 0.0787953 -0.0022342 0.3736719 0.1798027 -0.0823336 -0.0316417 -0.055072 0.3683161 0.0025055 -0.0720124 -0.0026229 0.3685518 unknown
polarizability: 56.7077579|2.0543014|40.2260028|-0.1614634|0.3459617|42.6733631 unknown
InChI: InChI=1S/CH5O4P/c1-5-6(2,3)4/h2-3H,1H3
charge 0 multiplicity 1
11 atoms
P  0.588485 -0.054623 0.007538
O  -0.885189 0.78307 -0.093935
O  0.382077 -1.271852 -1.19862
O  0.380292 -0.964906 1.459872
O  1.901679 0.823121 -0.09077
C  -2.173647 0.046137 -0.011897
H  -2.937363 0.832239 -0.09764
H  -2.254964 -0.473384 0.958054
H  -2.255858 -0.671467 -0.845786
H  1.169259 -1.403405 -1.784294
H  1.15393 -0.929031 2.076578
