program: Gaussian 09
title: 000170137
version: EM64L-G09RevD.01
frameworkgroup: C1[X(C18H21N3O6)]
method: RPBEPBE
basis: SDD
operation: Freq
keyword: #p
keyword: freq=noraman
keyword: PBEPBE/SDD
title: #p freq=noraman PBEPBE/SDD
converged: YES YES NO NO
title: Mulliken charges:
elementType: O O O O O O N N N C C C C C C C C C C C C C C C C C C H H H H H H H H H H H H H H H H H H H H H
charge: -0.129880 -0.262403 -0.162452 -0.227288 -0.212406 -0.181357 -0.035066 -0.051897 0.014498 0.279891 -0.315196 -0.574245 -0.735055 -0.736659 0.129262 -0.344754 0.159303 0.217267 -0.220377 0.123339 -0.672203 0.265355 -0.276936 -0.501625 0.490385 -0.389225 -0.799262 0.266305 0.263634 0.238818 0.259752 0.208470 0.218404 0.232942 0.277326 0.211100 0.299192 0.238999 0.225612 0.213099 0.226679 0.240800 0.282148 0.288136 0.244850 0.236343 0.245969 0.230411
chargesum: 0.00000
title: Mulliken charges with hydrogens summed into heavy atoms:
elementType: O O O O O O N N N C C C C C C C C C C C C C C C C C C
charge: -0.129880 -0.262403 -0.162452 -0.227288 -0.212406 -0.181357 -0.035066 -0.051897 0.014498 0.279891 -0.048891 -0.071793 -0.048428 -0.015291 0.129262 -0.045562 0.159303 0.217267 0.244233 0.123339 0.008375 0.265355 0.005212 -0.213489 0.490385 -0.144375 -0.086539
polarizability: 3.58887246e+02 5.79665655e+00 2.49171936e+02 -1.18829704e+01 1.94613389e+01 1.69274724e+02
1716.lowfreq: -4.8007 -0.0008 0.0004 0.0008 1.9603 5.0425 12.2785 17.9092 26.5649
frequency: 12.2128 17.7797 26.5427 31.1276 34.0941 50.1243 56.4950 61.8189 67.3756 79.8970 92.5525 116.3164 119.2768 135.4531 146.7453 166.9830 185.9624 206.3256 214.7417 220.1456 233.9366 243.3162 253.2328 260.2380 280.8505 305.9839 317.5906 329.1872 340.9318 362.6073 369.9193 374.5594 376.5422 401.0507 429.0564 438.3964 451.7387 460.1261 494.7583 551.2773 562.3016 583.6318 592.8716 600.0672 644.9156 661.4391 668.3376 695.7861 732.9474 740.1925 748.2057 792.5553 798.2623 810.1216 826.2536 838.1716 852.3991 877.0490 900.5226 915.6150 920.3334 928.5776 941.2548 950.1029 975.5173 984.5610 1004.6581 1010.6362 1018.8400 1034.0756 1044.2519 1049.0669 1066.6387 1100.9789 1106.5079 1115.4947 1135.8949 1141.8432 1148.0716 1163.9730 1188.3422 1192.7639 1204.4385 1210.0934 1222.8622 1226.7299 1250.3200 1264.2047 1270.5983 1279.9118 1292.1525 1311.3986 1349.9365 1358.5936 1371.8808 1382.6288 1401.6888 1401.7061 1406.8618 1419.0358 1433.1341 1448.7478 1461.4642 1463.0612 1468.4314 1473.5312 1474.2234 1477.3708 1480.7620 1482.9924 1486.0118 1496.6221 1564.9705 1614.9707 1620.7131 1641.3352 1657.6413 2907.1418 2964.7554 2976.7460 2980.4917 2981.7361 2983.9286 2997.3447 3013.8842 3064.4731 3065.4707 3068.3697 3073.3740 3074.3072 3093.9318 3094.9258 3096.4973 3110.5690 3110.7696 3138.4992 3166.4654 3169.3149
redmass: 6.8355 4.3188 5.4930 1.1031 3.0926 8.1635 5.0633 5.4770 5.3322 4.8924 5.0656 3.4385 5.0140 4.6919 5.9134 5.2422 2.4606 1.8150 3.6768 2.8627 2.4367 3.0401 1.0646 1.8667 3.0438 5.2715 5.1002 5.4810 3.8503 4.0208 4.9902 4.5336 3.4581 4.5439 4.7985 3.2042 4.9319 4.2790 4.4318 4.6145 4.4060 4.8715 5.5353 6.5205 5.8140 6.8948 5.1105 5.6037 7.5239 5.5520 5.2760 4.3884 1.1094 3.8436 3.2341 1.8438 2.2019 3.5899 4.3227 1.4165 2.8764 2.2569 3.8052 1.6076 1.3705 2.4142 1.4693 1.6679 2.0438 3.0444 2.5897 1.6064 2.9296 2.4312 1.9072 2.1927 1.4738 1.5406 1.3915 3.1631 2.2047 2.4386 7.4256 2.4283 1.8698 2.2961 1.1351 1.7474 1.6409 1.9324 1.7474 1.6993 6.8278 1.4102 5.1808 1.1896 1.2208 1.2617 1.1852 4.8953 1.0901 11.1137 1.0469 1.0398 1.1609 1.0652 1.0691 1.0560 2.5796 1.0557 1.0652 1.0565 6.5519 6.9561 9.8847 9.7660 11.5731 1.0785 1.0649 1.0374 1.0659 1.0392 1.0523 1.0359 1.0583 1.0946 1.0992 1.0975 1.0960 1.1064 1.0986 1.1001 1.0989 1.1028 1.0985 1.0896 1.0931 1.0947
irintensity: 1.4703 2.2204 1.9530 1.7181 1.3195 0.5137 0.2940 0.1407 2.4181 0.8374 0.4964 2.8035 0.2889 1.8852 0.2740 2.5411 2.9408 3.1159 3.1978 1.9603 1.1011 2.4758 0.1052 1.0068 1.0228 3.5458 3.7784 1.2088 1.4029 5.4382 2.5844 2.3362 10.8842 0.6994 16.1083 4.2339 0.3335 1.7915 14.1057 10.3708 12.2358 19.3964 15.8445 1.4297 10.2825 4.1831 0.5640 5.9192 13.1460 7.2241 2.8117 8.4686 3.3392 3.3770 32.6439 18.1538 7.0677 0.2985 1.4464 9.4695 11.4977 14.4973 11.4695 7.3605 3.4151 23.0777 2.0041 19.7360 54.2236 40.5765 44.8977 25.7825 5.7302 162.1419 78.7291 29.3516 3.6160 41.3078 10.2606 137.3582 22.5362 123.6337 82.8763 33.9087 44.7457 71.8937 0.2968 6.7994 18.4677 89.0491 64.1063 100.6080 124.8005 6.1782 55.3159 20.4853 16.9288 22.3819 33.6939 8.2043 11.2125 35.7371 3.2740 12.6301 20.8634 3.7464 15.4168 3.7052 42.3307 14.6669 11.2892 16.8406 16.1969 17.6449 219.3950 136.5214 86.2600 56.6057 8.6473 35.6103 14.3824 22.5864 6.8249 18.8047 19.1684 17.0679 10.2068 15.0491 53.6807 5.4843 29.2937 12.5760 11.6899 37.3687 6.2505 10.9300 0.4048 4.0617
temp: 298.150 k
press: 1.00000 atm
elementType: 8 8 8 8 8 8 7 7 7 6 6 6 6 6 6 6 6 6 6 6 6 6 6 6 6 6 6 1 1 1 1 1 1 1 1 1 1 1 1 1 1 1 1 1 1 1 1 1
symmnumber: 1
zpe: 962307.9 jmol-1
zpe.correction: 0.366524 hartree
zpe.thermalcorrener: 0.394301 hartree
zpe.thermalcorrenthalpy: 0.395245 hartree
zpe.thermalcorrgfe: 0.304264 hartree
zpe.sumelectzpe: -1311.970915 hartree
zpe.sumelectthermal: -1311.943138 hartree
zpe.sumelectthermalent: -1311.942194 hartree
zpe.sumelectthermalfe: -1312.033175 hartree
dipole: -0.4346 -2.6066 0.8483
dipole: 2.7754
quadrupole: -119.1263 -160.4291 -161.9342
quadrupole: -17.1940 -23.6488 -5.9524
quadrupole: 28.0369 -13.2659 -14.7710 -17.1940 -23.6488 -5.9524
hfenergy: -1312.3374391 hartree
pointgroup: C01 [X(C18H21N3O6)]
dipole: -0.0544882 1.0891844 -0.0546585 debye
polarizability: 356.5415576|-19.869822|237.58642|3.0981398|36.7785461|183.2059283 unknown
InChI: InChI=1S/C18H21N3O6/c1-5-27-17(24)14-16(23)15(13(22)9-18(14,3)4)20-19-11-7-6-10(2)8-12(11)21(25)26/h6-8,14-15H,5,9H2,1-4H3
charge 0 multiplicity 1
48 atoms
O  -1.723271 -0.711224 1.318671
O  -4.474482 -1.305665 -0.160959
O  0.193879 3.120336 0.053352
O  -5.071426 0.129441 1.572057
O  3.790893 -2.78851 -2.465843
O  1.720228 -2.337433 -1.610145
N  0.614219 0.427583 0.334807
N  1.45104 0.047453 -0.5725
N  3.000261 -2.161451 -1.654561
C  -3.320632 2.258533 0.276649
C  -3.234256 0.713754 -0.016004
C  -2.177205 2.945851 -0.540635
C  -4.678322 2.812334 -0.223543
C  -3.140426 2.571012 1.785933
C  -1.865987 0.17061 0.447503
C  -0.673154 0.845462 -0.267257
C  -0.7943 2.400543 -0.217207
C  -4.358407 -0.136087 0.579708
C  -5.434247 -2.332342 0.3611
C  2.786172 -0.188141 -0.114093
C  -5.328718 -3.540267 -0.56261
C  3.597674 -1.183572 -0.724774
C  3.399025 0.687821 0.818525
C  4.970752 -1.297431 -0.433515
C  5.579884 -0.422404 0.496536
C  4.766553 0.561977 1.123046
C  7.061359 -0.523586 0.801951
H  -3.279489 0.576344 -1.116823
H  -2.17046 4.032461 -0.346783
H  -2.366165 2.797167 -1.625421
H  -5.510955 2.395605 0.367591
H  -4.848382 2.57094 -1.290233
H  -4.703011 3.912226 -0.115449
H  -2.165876 2.221297 2.175953
H  -3.934763 2.08557 2.374799
H  -3.190842 3.662897 1.949455
H  -0.727763 0.567581 -1.347072
H  -5.146851 -2.564131 1.401922
H  -6.444854 -1.885514 0.36819
H  -6.01381 -4.335115 -0.215677
H  -5.602413 -3.273764 -1.597833
H  -4.302029 -3.943336 -0.565282
H  2.779419 1.46811 1.271693
H  5.544081 -2.084213 -0.932849
H  5.21832 1.241004 1.855249
H  7.413997 -1.568532 0.760431
H  7.654811 0.051547 0.065133
H  7.29643 -0.119746 1.801613
