program: Gaussian 09
title: 000170100
version: EM64L-G09RevD.01
frameworkgroup: C1[X(C17H16N2)]
method: RPBEPBE
basis: SDD
operation: Freq
keyword: #pfreq=noraman
keyword: PBEPBE/SDD
title: #p freq=noraman PBEPBE/SDD
converged: YES YES NO NO
title: Mulliken charges:
elementType: N N C C C C C C C C C C C C C C C C C H H H H H H H H H H H H H H H H
charge: -0.073544 -0.026901 -0.538992 0.508122 -0.359128 -0.422501 -0.391985 0.442175 -0.681865 -0.374385 -0.379481 -0.390949 0.264749 -0.338161 -0.360364 -0.365259 -0.350685 0.392316 -0.259167 0.205402 0.206298 0.213568 0.212895 0.237403 0.237166 0.211636 0.211693 0.223554 0.227206 0.273280 0.223947 0.250196 0.259607 0.254956 0.257197
chargesum: 0.00000
title: Mulliken charges with hydrogens summed into heavy atoms:
elementType: N N C C C C C C C C C C C C C C C C C
charge: -0.073544 -0.026901 -0.127292 0.508122 0.067335 -0.185098 -0.154819 0.442175 -0.034981 -0.147179 -0.106200 -0.167002 0.264749 -0.087965 -0.100756 -0.110303 -0.093488 0.392316 -0.259167
polarizability: 4.68130928e+02 -1.78502669e+00 1.63319509e+02 -1.31481870e+01 -4.32670899e-01 1.05321367e+02
1716.lowfreq: -4.7171 -0.0005 -0.0001 0.0003 2.0753 4.6705 20.5588 25.9283 43.7228
frequency: 20.4683 25.8776 43.6742 44.3642 65.4898 82.5807 113.7627 128.0495 163.9929 167.5944 228.5497 234.1637 244.4396 298.9316 310.9956 346.1651 379.9863 406.7855 410.8744 451.9885 458.3410 491.2187 536.4092 548.3108 568.5748 590.8177 633.2804 643.1199 715.4457 732.0269 744.8731 747.6964 786.7898 826.9011 828.7912 839.8763 848.3502 861.5858 865.4404 871.8281 893.4948 960.7140 962.8531 977.7267 987.4508 997.6630 1003.7344 1009.9202 1051.1236 1060.6152 1090.3821 1113.2068 1123.9806 1164.2054 1183.4802 1198.2037 1203.8341 1218.9145 1220.8074 1254.5930 1280.9961 1282.0038 1299.2254 1310.9028 1336.1928 1343.4188 1363.2693 1389.5258 1398.3651 1416.9242 1423.2018 1469.9809 1476.2205 1477.6185 1485.5632 1489.4064 1507.9206 1544.6511 1566.5458 1590.7107 1620.1952 1625.1643 2171.7496 2946.2485 2973.8844 2976.5374 2985.3345 3020.0401 3045.6305 3073.2863 3076.1231 3113.8885 3123.3049 3137.6481 3139.0327 3152.4217 3160.5538 3162.4090 3174.8368
redmass: 3.3684 5.8137 3.7676 4.0139 4.9796 1.9774 5.5373 5.8558 6.7507 5.8404 1.1456 3.3118 3.6114 4.7800 3.6223 2.7859 4.0154 2.9313 2.9789 5.3509 6.7585 5.8576 3.3132 6.3809 2.7917 4.4026 6.9383 7.2046 5.7612 3.7035 1.1648 3.2532 3.2378 5.0900 1.6056 1.4575 1.6389 1.5176 1.7795 1.6682 1.8601 1.3802 1.3710 1.3663 1.5427 1.4122 2.7371 2.8256 2.9867 1.4098 2.1405 1.3600 1.3271 1.9487 1.1226 1.9084 2.6078 2.3338 1.3985 1.9776 1.3504 1.1924 1.2966 1.4188 1.4513 3.3740 2.3858 1.2119 2.9393 3.1170 4.0289 1.0820 1.0484 1.0583 2.4519 1.0909 2.9272 6.9443 7.2706 6.2098 6.2813 6.7658 12.6281 1.0865 1.0402 1.0547 1.0600 1.1001 1.1035 1.1015 1.0992 1.0873 1.0893 1.0882 1.0964 1.0886 1.0953 1.0969 1.0978
irintensity: 0.1410 0.2734 0.3817 0.5644 0.8576 0.0593 1.4382 2.1929 1.9285 7.7302 0.0961 9.8740 0.9658 2.5906 3.2869 1.7954 1.2119 2.0109 1.6768 6.1797 3.3208 0.6768 13.2099 1.2670 33.1590 5.9224 0.3908 0.0130 3.2494 8.4191 4.7209 5.9114 15.0935 5.7265 23.3585 10.4861 28.2989 36.7155 36.9647 18.0619 0.2131 9.7993 1.3559 0.2331 21.5179 6.5165 6.4954 5.2690 0.4223 0.6383 51.1906 10.9552 18.4892 120.4946 21.5040 4.6167 10.1631 0.2231 0.0587 4.8061 2.6560 0.6518 0.0632 19.2086 5.3070 0.2136 4.9191 7.5353 4.2268 20.4340 5.8869 4.2949 10.2613 3.3511 36.1340 16.9014 39.8479 4.0654 180.0530 438.7591 19.8629 9.6647 101.4023 45.2521 25.8143 34.3357 64.3277 0.3720 11.7055 73.9089 43.4233 12.0969 21.0248 6.5859 26.5487 4.2744 4.7609 7.8784 4.0470
temp: 298.150 k
press: 1.00000 atm
elementType: 7 7 6 6 6 6 6 6 6 6 6 6 6 6 6 6 6 6 6 1 1 1 1 1 1 1 1 1 1 1 1 1 1 1 1
symmnumber: 1
zpe: 736398.7 jmol-1
zpe.correction: 0.280479 hartree
zpe.thermalcorrener: 0.298060 hartree
zpe.thermalcorrenthalpy: 0.299004 hartree
zpe.thermalcorrgfe: 0.232258 hartree
zpe.sumelectzpe: -765.566616 hartree
zpe.sumelectthermal: -765.549035 hartree
zpe.sumelectthermalent: -765.548091 hartree
zpe.sumelectthermalfe: -765.614837 hartree
dipole: 7.7209 -0.8340 -0.6268
dipole: 7.7911
quadrupole: -152.6278 -101.1908 -114.7249
quadrupole: -3.1479 3.7493 -0.2661
quadrupole: -29.7800 21.6570 8.1229 -3.1479 3.7493 -0.2661
hfenergy: -765.8470951 hartree
pointgroup: C01 [X(C17H16N2)]
dipole: 3.0309554 0.1126824 -0.4431892 debye
polarizability: 467.8975836|11.1587251|112.2297089|-11.3131049|18.6915606|156.644512 unknown
InChI: InChI=1S/C17H16N2/c1-2-3-14-4-6-16(7-5-14)13-19-17-10-8-15(12-18)9-11-17/h4-11,13H,2-3H2,1H3
charge 0 multiplicity 1
35 atoms
N  -0.879082 0.266225 0.445972
N  -7.717812 -0.459055 -0.029486
C  5.757962 0.456058 -0.047743
C  4.24536 0.44739 -0.185243
C  6.345119 -0.973868 0.138062
C  3.625803 0.421834 -1.462165
C  3.411249 0.420327 0.969022
C  1.396923 0.337194 -0.428149
C  7.881194 -0.963186 0.283282
C  2.223187 0.367663 -1.584844
C  2.012156 0.366017 0.856177
C  -0.062064 0.278556 -0.581129
C  -2.273408 0.107343 0.28898
C  -2.854488 -0.80032 -0.647913
C  -3.130891 0.837612 1.161391
C  -4.249527 -0.947484 -0.727869
C  -4.524903 0.703776 1.073406
C  -5.101524 -0.190001 0.124261
C  -6.52903 -0.338058 0.041189
H  6.220625 0.914068 -0.943586
H  6.058228 1.073309 0.821939
H  5.884862 -1.440602 1.031065
H  6.051209 -1.599989 -0.72712
H  4.250919 0.449103 -2.362758
H  3.875402 0.448632 1.962636
H  8.363781 -0.525929 -0.611025
H  8.195107 -0.365901 1.160036
H  8.276479 -1.986974 0.413417
H  1.760097 0.353017 -2.579842
H  1.366678 0.34995 1.740325
H  -0.439115 0.269061 -1.626842
H  -2.205155 -1.411396 -1.284585
H  -2.674641 1.508566 1.895227
H  -4.690796 -1.650266 -1.441878
H  -5.178103 1.277625 1.738089
