program: Gaussian 09
title: 000170099
version: EM64L-G09RevD.01
frameworkgroup: C1[X(C20H22N2)]
method: RPBEPBE
basis: SDD
operation: Freq
keyword: #pfreq=noraman
keyword: PBEPBE/SDD
title: #p freq=noraman PBEPBE/SDD
converged: YES YES NO NO
title: Mulliken charges:
elementType: N N C C C C C C C C C C C C C C C C C C C C H H H H H H H H H H H H H H H H H H H H H H
charge: -0.073267 -0.026949 -0.353053 -0.387928 -0.356318 -0.572016 -0.355284 0.514209 -0.694532 -0.433946 -0.388992 -0.375233 -0.384101 0.439901 -0.391810 0.264375 -0.337691 -0.360384 -0.365470 -0.350682 0.392256 -0.259206 0.191674 0.189552 0.210824 0.212537 0.190885 0.190034 0.211067 0.210659 0.195597 0.195328 0.216800 0.210415 0.210334 0.238215 0.237149 0.226870 0.273040 0.223529 0.249956 0.259679 0.254883 0.257096
chargesum: 0.00000
title: Mulliken charges with hydrogens summed into heavy atoms:
elementType: N N C C C C C C C C C C C C C C C C C C C C
charge: -0.073267 -0.026949 0.028173 0.035433 0.024601 -0.150290 0.035641 0.514209 -0.056983 -0.195732 -0.151843 -0.148363 -0.111061 0.439901 -0.168281 0.264375 -0.087735 -0.100705 -0.110587 -0.093586 0.392256 -0.259206
polarizability: 5.12637061e+02 5.05528049e+01 1.46826989e+02 -8.19812660e-01 4.28235950e+00 1.88517180e+02
1716.lowfreq: -5.0090 -1.2554 -0.0013 0.0007 0.0011 5.7384 13.7393 16.3092 38.3043
frequency: 13.3858 15.8585 38.2582 41.1259 42.7159 50.0624 64.0710 85.4340 111.5877 122.9081 124.2653 132.4850 158.1744 171.2963 217.3988 224.8770 235.3119 268.9646 293.3458 337.7994 351.2258 402.8085 407.6314 414.1048 421.7604 460.6650 464.6439 491.6080 540.9390 548.8945 569.6870 591.3931 633.3352 643.2669 716.5504 723.3558 733.1626 738.7153 748.5949 788.2885 789.7261 827.7119 830.7857 840.9142 849.1563 862.7525 868.0137 875.7887 888.6144 959.2521 964.0666 975.4717 977.9806 987.4749 997.0124 1003.8587 1007.2538 1010.5591 1012.3597 1062.2334 1072.5661 1076.1772 1113.4608 1114.4841 1125.3748 1164.8396 1183.6222 1191.4387 1198.2299 1204.6604 1218.1581 1228.9674 1239.6745 1255.0238 1276.0716 1280.9771 1284.9398 1290.9186 1300.2594 1310.0116 1321.1718 1343.2964 1344.4123 1353.2064 1363.6591 1387.6564 1398.9361 1416.7751 1423.3470 1462.6728 1463.2794 1469.1773 1475.9812 1476.6340 1484.6805 1486.3628 1489.1467 1507.8338 1545.0630 1566.3689 1590.5207 1620.0288 1625.1176 2171.7563 2946.8360 2951.5799 2956.4082 2967.4045 2970.5289 2972.5054 2979.9532 2988.7387 3003.1727 3019.1111 3032.8639 3050.4755 3069.1456 3072.1519 3113.9764 3122.8634 3138.4056 3139.5213 3152.2846 3160.6270 3162.6708 3174.8391
redmass: 5.4378 4.0416 2.2317 3.5060 3.7827 3.6849 3.0098 4.9864 1.9970 4.0717 4.8740 2.2035 6.8820 5.2432 4.3169 1.1514 2.9441 4.9300 4.4038 3.1173 3.4504 3.1015 2.9619 4.1368 3.0896 4.5822 5.9678 5.8401 3.3958 5.8673 2.7798 4.4250 6.9408 7.2048 6.0115 1.0652 3.4326 1.1339 3.7137 1.7428 1.8420 5.4285 1.5991 1.4063 1.6678 1.4732 2.3960 1.3313 1.8999 1.3951 1.3676 1.2135 1.3666 1.5465 1.4497 2.7632 3.6605 3.2415 3.0108 2.7517 1.3397 2.2904 2.3930 1.3635 1.3088 1.9985 1.1231 1.6678 1.8777 2.5777 2.2277 1.3529 1.3607 1.9976 1.1596 1.3587 1.0911 1.1054 1.2975 1.3928 1.4347 3.0083 1.5747 1.6480 2.3812 1.2154 2.8565 3.1256 4.0283 1.0745 1.0732 1.0804 1.0455 1.0763 1.0862 2.4377 1.0957 2.9219 6.9038 7.2502 6.1585 6.2845 6.7389 12.6281 1.0864 1.0589 1.0589 1.0591 1.0591 1.0364 1.0597 1.0975 1.1004 1.1021 1.1042 1.1046 1.1007 1.0993 1.0874 1.0893 1.0880 1.0963 1.0887 1.0952 1.0969 1.0978
irintensity: 0.3440 0.0953 0.2844 0.4674 0.5109 0.0958 0.2191 0.6109 0.4859 1.9987 0.3900 0.2059 2.5428 6.8131 7.2482 0.3952 3.8617 0.3737 3.1495 0.7506 2.0392 0.3397 2.6696 0.6955 5.6456 3.8202 2.7574 0.7512 11.8823 2.2445 34.7754 6.0397 0.4228 0.0143 3.3128 11.4684 7.1560 0.2654 5.4779 6.6570 8.1534 11.0119 16.9213 8.4889 33.9294 18.6333 62.9752 3.6948 6.9351 9.2762 0.8623 1.2488 0.2442 20.9354 6.8877 5.9462 0.1996 0.4805 9.6179 1.4715 2.5036 2.1446 44.6601 10.7141 18.4517 126.4428 20.8285 0.5588 5.6765 9.5539 0.1788 12.6985 0.1627 5.8355 0.8123 1.2167 0.4355 0.7218 0.1190 19.0824 4.8858 0.3247 2.0568 1.0717 3.7392 10.9151 4.1269 20.4069 6.3427 0.0022 0.9735 3.2659 11.5410 1.3329 3.5067 35.9932 22.9479 43.7155 4.4997 196.1199 457.5282 22.3884 9.9331 103.4570 46.1992 3.9503 10.4122 37.1315 32.7192 42.4097 102.0396 0.6899 0.8980 2.3908 23.8178 86.0602 94.7161 58.3682 12.6906 21.5249 6.6848 26.6206 4.4696 4.6389 7.9969 3.9683
temp: 298.150 k
press: 1.00000 atm
elementType: 7 7 6 6 6 6 6 6 6 6 6 6 6 6 6 6 6 6 6 6 6 6 1 1 1 1 1 1 1 1 1 1 1 1 1 1 1 1 1 1 1 1 1 1
symmnumber: 1
zpe: 955780.0 jmol-1
zpe.correction: 0.364037 hartree
zpe.thermalcorrener: 0.385863 hartree
zpe.thermalcorrenthalpy: 0.386808 hartree
zpe.thermalcorrgfe: 0.308726 hartree
zpe.sumelectzpe: -883.235800 hartree
zpe.sumelectthermal: -883.213974 hartree
zpe.sumelectthermalent: -883.213030 hartree
zpe.sumelectthermalfe: -883.291111 hartree
dipole: -7.7182 -1.7208 -0.7326
dipole: 7.9416
quadrupole: -192.1674 -135.5501 -120.3137
quadrupole: -8.7613 1.9809 1.8492
quadrupole: -42.8237 13.7936 29.0300 -8.7613 1.9809 1.8492
hfenergy: -883.5998376 hartree
pointgroup: C01 [X(C20H22N2)]
dipole: 3.0330791 0.5061447 -0.5536551 debye
polarizability: 512.7055507|45.2938333|148.9499465|-21.7193653|10.6294449|186.3257332 unknown
InChI: InChI=1S/C20H22N2/c1-2-3-4-5-6-17-7-9-19(10-8-17)16-22-20-13-11-18(15-21)12-14-20/h7-14,16H,2-6H2,1H3
charge 0 multiplicity 1
44 atoms
N  -2.239059 0.336406 0.433498
N  -8.96136 -1.17787 0.216207
C  6.583902 0.230982 -0.040361
C  5.053937 0.037618 -0.125245
C  7.349582 -1.09099 0.195174
C  4.291151 1.378475 -0.332242
C  8.882021 -0.902441 0.273332
C  2.786185 1.187569 -0.407714
C  9.638083 -2.225375 0.523773
C  2.111011 1.155838 -1.65551
C  2.020087 0.995919 0.778076
C  0.720081 0.937686 -1.720552
C  0.634012 0.776467 0.722716
C  -0.037196 0.742453 -0.533373
C  -1.484414 0.513439 -0.625681
C  -3.611288 0.019312 0.32792
C  -4.132852 -0.881442 -0.649783
C  -4.499224 0.574154 1.293905
C  -5.50338 -1.190075 -0.676872
C  -5.870716 0.27921 1.260098
C  -6.390199 -0.605822 0.270711
C  -7.792921 -0.919102 0.241788
H  6.947883 0.704533 -0.976221
H  6.819323 0.942032 0.779402
H  4.687711 -0.449136 0.801132
H  4.808808 -0.652329 -0.957531
H  7.110659 -1.806058 -0.619603
H  6.991019 -1.56045 1.134944
H  4.545976 2.056989 0.506264
H  4.661565 1.858275 -1.258723
H  9.241137 -0.441734 -0.669586
H  9.119169 -0.180844 1.081733
H  10.730612 -2.064804 0.576206
H  9.318316 -2.689439 1.475836
H  9.442012 -2.953739 -0.285736
H  2.682621 1.307736 -2.578827
H  2.526514 1.027631 1.750733
H  0.212467 0.920874 -2.6936
H  0.040544 0.632979 1.631431
H  -1.911557 0.523157 -1.651935
H  -3.453378 -1.361423 -1.362875
H  -4.085123 1.239541 2.057201
H  -5.897576 -1.886941 -1.4235
H  -6.548744 0.719539 1.997787
