program: Gaussian 09
title: 000170131
version: EM64L-G09RevD.01
frameworkgroup: C1[X(C14H18F13N2O4S)]
method: RPBEPBE
basis: SDD
operation: Freq
keyword: #p
keyword: freq=noraman
keyword: PBEPBE/SDD
title: #p freq=noraman PBEPBE/SDD
converged: YES YES NO NO
title: Mulliken charges:
elementType: S F F F F F F F F F F F F F O O O O N N C C C C C C C C C C C C C C H H H H H H H H H H H H H H H H H H
charge: 1.017889 -0.115918 -0.094489 -0.114932 -0.115491 -0.111183 -0.126258 -0.126150 -0.108191 -0.129598 -0.114082 -0.129347 -0.117452 -0.111191 -0.498608 -0.458958 -0.379279 -0.268314 -0.114939 -0.409473 -0.313820 -0.393204 -0.387781 0.139335 0.276465 0.266691 -0.591704 -0.557963 -0.548618 -0.426214 0.263381 0.210055 0.256081 0.379405 0.287583 0.298227 0.246158 0.238554 0.268494 0.265620 0.320059 0.258797 0.255637 0.269061 0.263197 0.266388 0.272301 0.278751 0.258600 0.289193 0.311782 0.405452
chargesum: 1.00000
title: Mulliken charges with hydrogens summed into heavy atoms:
elementType: S F F F F F F F F F F F F F O O O O N N C C C C C C C C C C C C C C
charge: 1.017889 -0.115918 -0.094489 -0.114932 -0.115491 -0.111183 -0.126258 -0.126150 -0.108191 -0.129598 -0.114082 -0.129347 -0.117452 -0.111191 -0.498608 -0.458958 0.026174 -0.268314 -0.114939 -0.409473 0.271989 0.091508 0.146333 0.139335 0.276465 0.266691 0.242789 0.240682 0.261035 0.174761 0.263381 0.210055 0.256081 0.379405
polarizability: 2.66980010e+02 -3.48515190e+00 2.03075755e+02 -8.45929781e+00 -1.33859324e+00 1.82029431e+02
1716.lowfreq: -0.0017 -0.0016 0.0005 1.0478 4.4747 8.6706 12.8786 15.4358 21.9920
frequency: 12.7480 14.9731 21.7200 30.8017 36.5206 40.2000 43.1475 47.9415 58.2038 60.3997 72.4970 86.4825 90.1132 105.4101 112.2982 128.1650 130.2012 133.9328 145.0820 146.9914 160.8153 163.8402 186.3900 191.9584 201.0303 212.5933 219.2344 224.6714 231.6590 245.1001 247.0615 264.8552 265.9230 270.7942 273.6472 281.8801 286.0541 291.1857 295.9946 297.3596 304.2641 314.9493 328.8517 331.5308 347.9454 353.4379 364.8949 370.6187 397.1090 406.3439 418.0310 425.6907 435.0131 442.0596 443.4662 461.9019 471.1602 485.4133 513.3002 521.9499 539.1509 551.5299 565.0361 568.7863 584.1056 588.1164 630.9400 653.2215 655.7173 732.5843 763.7392 773.5715 820.6238 822.7076 835.1679 855.0929 865.1385 895.9087 904.7887 932.4998 942.8772 954.6571 971.3528 981.8983 982.0796 1002.4841 1017.2606 1018.7707 1030.5185 1043.5198 1047.2056 1050.9649 1057.4740 1067.5078 1070.0466 1076.3918 1086.2238 1091.5632 1113.3101 1117.9418 1133.4287 1134.6836 1146.7851 1160.6251 1178.4600 1190.9438 1209.7306 1223.4707 1253.8798 1260.8545 1273.6560 1280.1156 1306.3303 1336.0300 1350.8588 1365.3480 1371.2778 1392.9852 1417.9215 1423.5618 1431.0022 1442.4380 1448.7489 1455.6068 1460.9601 1467.9114 1472.7112 1476.5119 1487.1871 1492.5382 1508.6962 1657.5507 2996.2143 2997.5256 3008.0889 3024.1429 3025.6725 3028.5326 3036.3388 3060.0372 3062.1482 3080.1916 3116.4317 3140.0305 3141.7116 3145.6201 3146.5963 3151.0902 3152.8086 3522.0851
redmass: 8.6604 7.6565 10.6726 10.0406 7.9938 3.1307 10.1806 6.3648 9.0863 15.2466 9.7841 10.7904 4.7389 17.4997 15.6383 13.5552 5.3919 11.3685 7.5805 3.2656 3.8083 12.6656 13.4619 17.6854 2.0143 8.5405 2.5626 1.8365 10.9907 12.7943 18.0107 12.0569 17.0337 1.1495 3.4835 16.8848 9.4981 5.5022 13.6541 1.2708 14.9727 18.5718 6.1608 10.1910 2.2953 2.4873 15.5453 2.8078 13.7327 14.1066 8.0457 4.4882 2.3219 8.1249 5.1020 17.6904 2.6145 2.5892 17.5721 2.7735 13.1243 14.2375 16.2003 4.7966 16.9036 17.5323 1.6818 4.4688 5.3336 2.7356 6.1126 1.9370 3.5156 13.1277 13.9172 2.2114 3.0927 13.2994 2.6638 2.6805 2.9540 13.4681 5.8577 10.2822 3.9934 13.0101 5.2108 3.0210 12.2211 12.7298 12.9155 1.2218 2.3112 2.8613 3.6705 12.7636 1.7111 12.7896 10.2501 1.6872 8.0257 1.7239 11.9180 11.7253 1.6040 12.3308 1.6508 1.9593 1.7834 1.5119 1.7136 1.7294 1.3054 1.1972 1.2038 1.3900 1.2566 1.2777 1.1322 1.1560 1.1451 1.0807 1.0855 1.0511 1.1143 1.0552 1.0640 1.0835 1.0544 1.0653 1.0544 8.7078 1.0614 1.0610 1.0611 1.0320 1.0319 1.0341 1.0591 1.0994 1.1020 1.1010 1.1074 1.1055 1.1054 1.1051 1.1055 1.1054 1.1051 1.0649
irintensity: 0.9790 1.6523 0.5869 1.0684 0.3203 0.1833 0.8626 3.9375 2.0603 0.7674 3.5145 0.8966 8.6765 0.6051 0.7739 0.6143 3.2791 1.5513 3.3230 0.3887 0.5081 1.6329 5.8481 17.4963 2.7519 5.3704 1.9846 0.1965 1.1504 2.4022 0.2863 4.2125 1.6999 0.5150 4.5382 0.8266 1.9543 1.7239 0.0434 1.4104 0.2351 0.4883 3.8821 2.6261 0.6870 1.3817 1.3994 2.0176 58.4121 7.7548 3.0306 66.4011 4.1616 46.3005 31.5100 9.0272 35.8465 43.6919 0.9697 4.8899 1.6163 7.2327 3.7502 40.2715 6.1121 0.4396 63.0479 183.5360 20.6549 8.3359 115.2420 37.6310 15.2087 170.1477 62.3830 14.3168 30.5469 87.2282 34.5016 18.3144 7.3577 104.3409 37.8874 13.4197 4.5842 76.7382 110.8146 39.6009 86.2587 85.4561 57.3868 6.7068 280.8122 18.3848 27.8057 345.8756 5.1962 282.4248 53.3178 3.6245 72.6938 14.4075 43.9963 41.6888 11.4027 53.8397 6.9768 3.9451 7.7005 6.7937 38.1831 13.1930 5.5588 4.3168 4.5686 31.8719 10.5448 1.2055 58.8205 19.0331 14.6092 1.8557 23.7742 0.5629 25.0430 0.2203 4.0278 0.8842 49.0623 48.8094 91.5211 292.5966 8.7699 6.5645 23.0275 3.1412 4.2611 14.3991 6.1042 2.5558 2.7938 10.1564 1.2201 1.2136 1.0609 5.5142 8.6996 0.3836 12.8567 71.6187
temp: 298.150 k
press: 1.00000 atm
elementType: 16 9 9 9 9 9 9 9 9 9 9 9 9 9 8 8 8 8 7 7 6 6 6 6 6 6 6 6 6 6 6 6 6 6 1 1 1 1 1 1 1 1 1 1 1 1 1 1 1 1 1 1
symmnumber: 1
zpe: 889892.2 jmol-1
zpe.correction: 0.338942 hartree
zpe.thermalcorrener: 0.376940 hartree
zpe.thermalcorrenthalpy: 0.377884 hartree
zpe.thermalcorrgfe: 0.265790 hartree
zpe.sumelectzpe: -2647.508500 hartree
zpe.sumelectthermal: -2647.470502 hartree
zpe.sumelectthermalent: -2647.469558 hartree
zpe.sumelectthermalfe: -2647.581652 hartree
dipole: 26.9022 -1.1937 1.2636
dipole: 26.9583
quadrupole: -28.8543 -178.9896 -192.9320
quadrupole: -18.5117 -8.0333 3.9619
quadrupole: 104.7377 -45.3977 -59.3400 -18.5117 -8.0333 3.9619
hfenergy: -2647.8474418 hartree
pointgroup: C01 [X(C14H18F13N2O4S1)]
dipole: -10.5819462 0.2387549 0.6760224 debye
polarizability: 267.3160145|-2.8769166|202.640494|6.9573015|3.0459619|182.1286878 unknown
InChI: InChI=1S/C14H18F13N2O4S/c1-29(2,3)6-4-5-28(7-8(30)31)34(32,33)14(26,27)12(21,22)10(17,18)9(15,16)11(19,20)13(23,24)25/h30H,4-7H2,1-3H3
charge 1 multiplicity 1
52 atoms
S  -1.19525 0.034674 -0.123776
F  -0.056956 0.080982 2.437445
F  0.976859 -1.375187 1.034451
F  1.03821 2.246923 1.299677
F  2.63955 0.759736 1.9627
F  3.160601 2.304879 -0.330395
F  1.25866 1.498075 -1.317886
F  2.214144 -1.037978 -1.353247
F  3.533182 0.525891 -2.37014
F  3.971746 -1.30213 0.739402
F  4.863317 -1.60724 -1.341661
F  5.299512 1.123528 1.010924
F  6.003444 1.070966 -1.150764
F  6.693601 -0.520717 0.312792
O  -1.696269 1.573626 -0.183983
O  -0.877157 -0.887597 -1.409164
O  -3.429733 -4.159516 -0.436077
O  -4.467761 -2.111742 -0.793258
N  -6.143382 1.238628 -0.458851
N  -2.430571 -0.850511 0.845436
C  -4.726055 0.932918 0.090725
C  -4.681471 0.190562 1.433221
C  -3.204455 -0.087288 1.842519
C  0.518682 -0.068144 1.167271
C  1.636462 1.0022 0.990407
C  2.317044 1.181191 -0.422484
C  -6.976429 -0.03941 -0.572036
C  -6.862882 2.251557 0.424353
C  -5.965956 1.833232 -1.858026
C  -2.470563 -2.301052 0.694131
C  3.129981 0.018114 -1.117812
C  4.395685 -0.634374 -0.434512
C  -3.56866 -2.799243 -0.259166
C  5.619465 0.283509 -0.063273
H  -4.19637 1.899191 0.144334
H  -4.243282 0.304973 -0.674971
H  -5.220215 -0.769866 1.36511
H  -5.128177 0.781032 2.255969
H  -2.688719 0.873769 2.019714
H  -3.192238 -0.643661 2.798915
H  -6.361869 -0.823455 -1.038836
H  -7.288154 -0.362028 0.431909
H  -7.867973 0.176774 -1.180739
H  -6.27352 3.180653 0.459964
H  -7.857926 2.455686 -0.000532
H  -6.973781 1.840156 1.437699
H  -5.298879 2.706355 -1.796303
H  -5.518532 1.070821 -2.513092
H  -6.949258 2.135839 -2.249503
H  -2.619572 -2.782522 1.680369
H  -1.510919 -2.686501 0.302417
H  -4.112714 -4.529777 -1.058668
