program: Gaussian 09
title: 000170077
version: EM64L-G09RevD.01
frameworkgroup: C1[X(C5H8Br2ClO2P)]
method: RPBEPBE
basis: SDD
operation: Freq
keyword: #p
keyword: freq=noraman
keyword: PBEPBE/SDD
title: #p freq=noraman PBEPBE/SDD
converged: NO YES NO NO
title: Mulliken charges:
elementType: Br Br Cl P O O C C C C C H H H H H H H H
charge: -0.013964 0.008697 -0.267321 0.904929 -0.494231 -0.490880 0.301783 -0.392042 -0.357587 -0.716905 -0.751846 0.272769 0.268169 0.266211 0.237340 0.304645 0.321030 0.308698 0.290504
chargesum: 0.00000
title: Mulliken charges with hydrogens summed into heavy atoms:
elementType: Br Br Cl P O O C C C C C
charge: -0.013964 0.008697 -0.267321 0.904929 -0.494231 -0.490880 0.301783 0.148896 0.145965 -0.091230 -0.152643
polarizability: 1.37354469e+02 9.14748660e-02 1.15362030e+02 -1.96698804e+00 2.50441421e+00 1.10957614e+02
1716.lowfreq: -5.8379 -1.6741 -0.0005 0.0013 0.0019 3.2752 29.9989 53.4748 61.3381
frequency: 29.6305 53.3976 61.2934 88.4963 137.8813 162.4513 187.2057 205.5635 230.4659 260.6787 278.7287 311.7028 361.6179 405.1877 434.5250 477.2258 576.0785 589.5119 631.0761 642.3667 668.6289 765.4021 836.9708 860.2059 900.2415 912.9772 962.3854 963.9093 1041.8847 1068.7800 1153.2723 1186.8603 1205.4253 1235.7436 1267.4009 1276.1291 1298.4098 1355.9992 1368.5444 1431.5528 1434.1674 1447.6363 1461.6861 3005.6710 3021.8427 3050.4151 3059.8403 3104.5814 3115.8309 3136.9710 3148.4249
redmass: 14.3117 18.4942 25.5046 15.7412 4.6630 7.0539 4.0303 10.7869 4.0311 4.0271 6.4944 2.3208 4.6410 6.5550 5.3941 3.3933 5.3424 9.3153 4.9880 5.5253 7.3654 4.2247 1.7057 2.1061 3.4315 2.7200 4.0056 1.9490 2.0619 1.5586 2.5109 1.2892 1.2303 1.0758 1.2964 1.2824 1.4722 1.2053 1.2219 1.0908 1.0915 1.0754 1.0829 1.0631 1.0630 1.0567 1.0567 1.1021 1.1035 1.1099 1.1106
irintensity: 0.8726 0.9909 1.1840 0.1205 6.1749 1.1870 4.2161 6.1656 14.2325 0.7881 3.0142 3.6522 32.1348 54.0233 9.0103 7.8018 24.5653 58.2270 36.0159 3.3100 112.6373 2.3799 42.4832 32.9735 16.4798 21.4828 146.0603 36.8591 35.9018 6.9539 1.0774 0.8577 0.6398 6.4486 36.1719 26.4352 1.8126 9.6828 8.3494 7.6118 13.3286 23.3715 11.3786 31.0301 9.3901 14.8700 2.5135 0.7366 2.8554 1.6461 1.6928
temp: 298.150 k
press: 1.00000 atm
elementType: 35 35 17 15 8 8 6 6 6 6 6 1 1 1 1 1 1 1 1
symmnumber: 1
zpe: 340175.3 jmol-1
zpe.correction: 0.129566 hartree
zpe.thermalcorrener: 0.142468 hartree
zpe.thermalcorrenthalpy: 0.143412 hartree
zpe.thermalcorrgfe: 0.086925 hartree
zpe.sumelectzpe: -1173.131445 hartree
zpe.sumelectthermal: -1173.118543 hartree
zpe.sumelectthermalent: -1173.117599 hartree
zpe.sumelectthermalfe: -1173.174086 hartree
dipole: -0.6075 -1.9703 2.6501
dipole: 3.3577
quadrupole: -109.6664 -105.8134 -94.9530
quadrupole: -2.0720 3.1903 0.0538
quadrupole: -6.1889 -2.3358 8.5246 -2.0720 3.1903 0.0538
hfenergy: -1173.2610113 hartree
pointgroup: C01 [X(C5H8Br2Cl1O2P1)]
dipole: -0.2576346 -0.6057122 1.1453573 debye
dipolederiv: -0.2267095 0.1833725 -0.0240535 0.1948209 -0.4609893 0.0603578 0.0123918 -0.0068344 -0.137903 -0.4009461 -0.147647 -0.0483598 -0.1863181 -0.2013583 -0.0598967 -0.1699282 -0.0987043 -0.1821843 -0.4109305 0.0322877 -0.0018211 -0.0449447 -0.28837 0.1008494 0.3468304 0.094914 -0.872317 1.6055562 -0.0287329 -0.2534753 -0.0510862 0.921957 0.1560766 -0.3357323 -0.0210285 1.1997625 -1.2221592 -0.1797448 0.0242226 -0.0442343 -0.582478 0.0186401 -0.1974912 -0.0284684 -0.4297377 -1.2975133 0.2031196 0.3002232 0.1200313 -0.4506677 -0.3146788 0.0326965 -0.0593363 -0.4638883 -0.1967236 0.0873926 -0.0383018 -0.0177736 -0.2207988 -0.0673399 -0.1187762 -0.3398518 -0.133523 0.6958389 -0.010804 0.0116289 -0.2003054 0.1578602 -0.0003168 0.1493035 0.1862814 0.2590708 0.6953405 -0.0780888 -0.226924 0.2689142 0.0996885 -0.0206039 0.1284978 0.093408 0.3509305 0.1238861 -0.3870671 0.0569585 -0.385342 0.6998011 -0.0128249 0.027141 0.0243441 0.0181013 0.4996334 0.3089048 0.191957 0.2949544 0.2144529 0.1742032 0.2217907 0.2044137 0.2262729 0.0044738 -0.0709701 -0.0076452 -0.0145463 -0.0143286 0.0192662 -0.0165707 0.029602 0.0807054 0.01012 -0.0098598 0.048342 0.0246853 0.1301386 0.0291392 -0.040972 -0.0136133 -0.0519933 0.01983 0.0605272 0.080201 0.0129525 0.0315175 -0.0571713 0.0487836 -0.0397904 0.1123363 -0.012968 0.0221643 0.0208657 -0.042307 0.0324282 0.1496004 0.0215268 0.0708497 -0.0740669 0.0547726 0.080638 -0.0452125 0.0319532 -0.0518693 -0.0862663 -0.0480482 -0.0399831 0.0325383 0.0403849 -0.0073646 0.0594991 0.0530251 -0.0250159 -0.0115094 0.0412136 0.0016874 0.0735116 -0.0108021 -0.0342516 -0.0398311 0.0422277 0.0069253 -0.1110152 -0.0354851 -0.0999048 0.0572318 0.0289157 -0.0238758 -0.1082737 -0.0567069 0.0011066 0.0334904 -0.0671718 0.0420148 -0.0648479 unknown
polarizability: 137.4146611|-0.202508|116.0193507|-1.4939721|1.7080041|110.2401008 unknown
InChI: InChI=1S/C5H8Br2O2P.Cl/c6-1-5(2-7)3-8-10-9-4-5;/h1-4H2;
charge 0 multiplicity 1
19 atoms
Br -1.83504 2.54482 -0.658017
Br -3.301138 -1.430115 -0.386439
Cl 2.753711 0.039135 -1.741425
P  2.540152 -0.386255 0.558159
O  1.31882 -1.634244 0.570469
O  1.490141 0.964473 0.969322
C  -0.709268 -0.083303 0.256422
C  0.049559 -1.39992 -0.178276
C  0.103236 0.635947 1.379415
C  -0.829655 0.813222 -0.996523
C  -2.075528 -0.428716 0.886121
H  -0.551105 -2.295863 0.035116
H  0.302867 -1.379813 -1.253813
H  -0.341854 1.615917 1.611622
H  0.132692 0.003142 2.287002
H  -1.40547 0.317502 -1.792296
H  0.159091 1.1310 -1.359299
H  -2.644634 0.472012 1.160942
H  -1.964876 -1.105142 1.748598
