program: Gaussian 09
title: 000170073
version: EM64L-G09RevD.01
frameworkgroup: C1[X(C9H5F13O)]
method: RPBEPBE
basis: SDD
operation: Freq
keyword: #p
keyword: freq=noraman
keyword: PBEPBE/SDD
title: #p freq=noraman PBEPBE/SDD
converged: YES YES NO NO
title: Mulliken charges:
elementType: F F F F F F F F F F F F F O C C C C C C C C C H H H H H
charge: -0.161544 -0.158026 -0.126643 -0.135362 -0.133490 -0.123882 -0.131936 -0.117374 -0.115972 -0.124604 -0.120881 -0.122956 -0.124294 -0.283335 -0.007073 -0.565347 0.304512 0.226728 0.256508 -0.349692 0.254692 0.208177 0.373380 0.265403 0.273678 0.277476 0.233687 0.228168
chargesum: 0.00000
title: Mulliken charges with hydrogens summed into heavy atoms:
elementType: F F F F F F F F F F F F F O C C C C C C C C C
charge: -0.161544 -0.158026 -0.126643 -0.135362 -0.133490 -0.123882 -0.131936 -0.117374 -0.115972 -0.124604 -0.120881 -0.122956 -0.124294 -0.283335 0.258330 -0.014193 0.304512 0.226728 0.256508 0.112163 0.254692 0.208177 0.373380
polarizability: 1.26095439e+02 2.16119778e+00 9.51283401e+01 -1.23510531e+00 -1.11186922e+00 9.35233774e+01
1716.lowfreq: -5.9650 -0.0005 -0.0004 0.0003 3.2407 6.4764 27.7196 29.7874 39.7702
frequency: 27.6622 29.6549 39.7654 50.5400 64.4558 78.0974 90.2480 107.0666 110.0712 134.4908 141.4322 167.9991 194.4820 203.3660 222.9201 239.8619 249.6882 256.6159 275.4602 283.7070 290.3230 298.6088 305.3170 313.2388 319.5048 327.5256 330.3354 368.4590 405.5959 414.9497 423.3270 444.0810 463.1380 510.5936 523.8783 554.3641 562.7946 584.0897 587.6912 654.1705 696.4379 757.1725 802.7581 819.4854 854.0017 869.6382 904.7029 945.2384 965.7705 980.0666 1009.7800 1014.6686 1026.0061 1033.6604 1038.0952 1047.8474 1075.7415 1082.3015 1094.7793 1114.2742 1121.1347 1130.4503 1137.9935 1150.7945 1157.1728 1177.7346 1188.9946 1234.3367 1250.1102 1346.5079 1402.6924 1440.5668 1483.3658 3032.7401 3078.0034 3092.7695 3119.2032 3188.0256
redmass: 10.7153 9.0392 8.8485 5.5599 9.0592 5.6154 9.9350 11.4908 14.1082 16.9590 11.6832 14.6755 16.0978 10.1936 11.8592 16.9372 17.9441 15.5617 16.3295 18.0027 16.0603 18.4319 17.1837 8.0243 10.3338 6.7805 17.9333 9.6352 7.9015 2.5755 9.3723 11.1265 17.4333 14.0689 11.8201 15.3962 14.9365 16.4600 17.4390 16.9102 7.5804 6.6450 3.9746 11.4815 1.9347 8.0841 2.8973 4.1476 4.3845 5.2892 1.7577 7.4039 10.8567 4.0976 10.7214 7.5772 11.2162 11.7264 1.5387 8.0824 1.5986 3.3041 3.9684 5.7432 11.1929 4.2572 12.1164 1.4797 1.4059 1.5270 1.9083 1.0885 1.2063 1.0603 1.0536 1.1007 1.0927 1.1194
irintensity: 0.0508 0.1756 0.4284 1.6118 0.0136 5.4070 1.2097 1.0977 0.8848 1.7892 1.9427 1.2148 16.8787 7.6646 2.1487 0.2213 0.1805 1.7644 0.9049 1.1949 0.7547 0.0850 0.0638 2.4221 0.3785 8.2865 0.3943 1.0255 6.7759 3.6648 4.1056 0.2911 8.8336 5.0630 4.3434 3.9683 9.6347 3.7598 1.3957 48.9672 55.7807 26.9921 17.2415 201.9113 27.9886 37.5938 49.8456 110.9475 57.1597 3.6045 32.4524 135.8251 83.1348 33.4622 74.7147 54.8602 194.6956 348.7278 37.8001 37.2836 14.1248 59.9648 11.2320 43.7264 3.9120 13.2575 44.7469 12.8248 6.3074 21.3411 18.6950 18.0220 4.7178 3.5490 17.3700 1.2054 7.5305 21.6648
temp: 298.150 k
press: 1.00000 atm
elementType: 9 9 9 9 9 9 9 9 9 9 9 9 9 8 6 6 6 6 6 6 6 6 6 1 1 1 1 1
symmnumber: 1
zpe: 373920.3 jmol-1
zpe.correction: 0.142419 hartree
zpe.thermalcorrener: 0.165435 hartree
zpe.thermalcorrenthalpy: 0.166379 hartree
zpe.thermalcorrgfe: 0.089078 hartree
zpe.sumelectzpe: -1717.249237 hartree
zpe.sumelectthermal: -1717.226220 hartree
zpe.sumelectthermalent: -1717.225276 hartree
zpe.sumelectthermalfe: -1717.302578 hartree
dipole: 1.2092 0.0052 -0.4447
dipole: 1.2884
quadrupole: -128.9884 -134.2243 -132.8138
quadrupole: 4.6544 -6.2911 2.6520
quadrupole: 3.0204 -2.2155 -0.8050 4.6544 -6.2911 2.6520
hfenergy: -1717.3916555 hartree
pointgroup: C01 [X(C9H5F13O1)]
dipole: -0.4747403 0.0106136 -0.1773474 debye
polarizability: 126.0279327|2.3540935|94.9340157|1.6437018|1.2822954|93.7852085 unknown
InChI: InChI=1S/C9H5F13O/c10-4(11,1-3-2-23-3)5(12,13)6(14,15)7(16,17)8(18,19)9(20,21)22/h3H,1-2H2
charge 0 multiplicity 1
28 atoms
F  -1.313375 0.632464 -1.465632
F  -2.534739 -1.293545 -1.418802
F  0.136066 -1.679059 -1.019337
F  -1.216674 -2.264708 0.728902
F  -0.468388 -0.123898 2.201134
F  1.242035 -1.461306 1.488445
F  0.228192 1.855433 0.43918
F  1.838288 1.171186 1.901421
F  1.551542 0.64836 -1.685158
F  2.774442 2.124529 -0.444574
F  4.355972 0.17321 -1.36779
F  4.043109 -0.17108 0.851815
F  2.992949 -1.493653 -0.669881
O  -5.228754 1.124018 0.561786
C  -4.028011 0.9078 -0.320549
C  -2.840035 0.280561 0.399088
C  -1.858458 -0.351421 -0.577943
C  -0.654407 -1.159218 0.029888
C  0.317026 -0.47638 1.068757
C  -5.278197 0.12695 -0.575501
C  1.151179 0.815609 0.716337
C  2.212823 0.825378 -0.453267
C  3.416751 -0.189762 -0.397763
H  -3.79675 1.758709 -0.972853
H  -3.199225 -0.492668 1.100549
H  -2.321853 1.053658 0.992154
H  -5.928269 0.410744 -1.410569
H  -5.324841 -0.923612 -0.264537
