program: Gaussian 09
title: 000170049
version: EM64L-G09RevD.01
frameworkgroup: C1[X(C6H11FO5)]
method: RPBEPBE
basis: SDD
operation: Freq
keyword: #p
keyword: freq=noraman
keyword: PBEPBE/SDD
title: #p freq=noraman PBEPBE/SDD
converged: YES YES NO NO
title: Mulliken charges:
elementType: F O O O O O C C C C C C H H H H H H H H H H H
charge: -0.234040 -0.473236 -0.427178 -0.485616 -0.486071 -0.154025 -0.182506 -0.139703 -0.035858 -0.043511 -0.366973 -0.055186 0.231400 0.277514 0.240083 0.230037 0.237503 0.202039 0.379606 0.362390 0.377991 0.182359 0.362980
chargesum: 0.00000
title: Mulliken charges with hydrogens summed into heavy atoms:
elementType: F O O O O O C C C C C C
charge: -0.234040 -0.093630 -0.064788 -0.107625 -0.123091 -0.154025 0.048894 0.137811 0.204225 0.186527 0.072569 0.127174
polarizability: 1.04182445e+02 2.03891393e-01 7.54251906e+01 2.45193070e+00 2.25207904e+00 6.44671562e+01
1716.lowfreq: -6.3619 0.0009 0.0009 0.0011 5.5143 12.6545 43.6354 56.2952 74.0740
frequency: 43.5589 56.2750 74.0678 94.5578 110.5437 130.0665 180.8300 227.3999 230.9240 247.7494 261.3687 265.7189 296.7515 316.6653 429.6653 445.6233 461.6569 499.8458 542.8072 611.8567 625.5724 674.6262 737.8115 754.5674 846.0056 867.8814 917.1336 962.1798 981.6477 997.0728 1028.1541 1042.7342 1049.1884 1055.3846 1088.0998 1166.0157 1191.4512 1200.3370 1223.3102 1244.5271 1255.6370 1278.5119 1287.6878 1333.8382 1338.2851 1349.8736 1373.5552 1387.3578 1393.1921 1434.2131 1463.7198 1664.6433 2896.4648 2966.2436 2990.2721 2995.4384 3009.7557 3051.6803 3057.2600 3448.6577 3519.8924 3531.1389 3604.5687
redmass: 8.0071 7.2555 4.7067 6.1568 3.6642 3.5744 5.2966 5.5754 6.2071 1.2431 4.8249 4.7305 5.8284 6.3913 2.3446 4.2209 1.1146 1.2228 3.7466 1.1450 3.6108 5.3877 4.3776 3.9081 3.4600 2.5484 2.3547 6.5413 3.1692 4.0867 2.7138 2.2633 2.1039 2.2489 2.6379 1.1069 1.1985 1.3305 1.1782 1.5549 1.1796 1.2186 1.3350 1.2381 1.3565 1.3449 1.1752 1.1881 1.4114 1.9508 1.0842 9.2197 1.0859 1.0621 1.0818 1.0837 1.0854 1.0856 1.1028 1.0645 1.0650 1.0650 1.0670
irintensity: 3.2499 0.9067 9.4780 4.9511 3.1984 10.4911 8.4453 9.9410 3.2233 127.2810 17.9959 29.7462 6.0678 6.2775 25.6396 17.4714 30.3929 202.0457 39.6096 243.9511 22.9088 65.1970 10.4205 20.6874 42.0353 35.2848 16.3969 52.0430 42.1554 44.3869 39.1236 13.0401 49.1660 4.8132 56.6365 52.8204 50.0700 29.8874 34.9518 3.7060 10.6210 1.4876 21.8486 17.8856 12.3294 28.6572 27.9943 10.8791 3.3410 2.8570 9.7729 133.1805 74.7341 38.3482 8.7945 11.7146 51.6204 9.3923 43.2050 36.4234 36.3297 40.2520 9.8290
temp: 298.150 k
press: 1.00000 atm
elementType: 9 8 8 8 8 8 6 6 6 6 6 6 1 1 1 1 1 1 1 1 1 1 1
symmnumber: 1
zpe: 459446.9 jmol-1
zpe.correction: 0.174994 hartree
zpe.thermalcorrener: 0.188764 hartree
zpe.thermalcorrenthalpy: 0.189709 hartree
zpe.thermalcorrgfe: 0.134131 hartree
zpe.sumelectzpe: -710.167480 hartree
zpe.sumelectthermal: -710.153710 hartree
zpe.sumelectthermalent: -710.152766 hartree
zpe.sumelectthermalfe: -710.208343 hartree
dipole: -4.5296 0.6099 -2.3932
dipole: 5.1592
quadrupole: -73.7641 -69.3930 -71.4249
quadrupole: -10.3090 -2.2979 2.6620
quadrupole: -2.2368 2.1343 0.1025 -10.3090 -2.2979 2.6620
hfenergy: -710.3424745 hartree
pointgroup: C01 [X(C6H11F1O5)]
dipole: 1.782586 0.3841079 0.891525 debye
dipolederiv: -0.4257129 0.0031104 0.0400206 -0.0379513 -0.7153736 -0.0037811 0.0743737 0.0426905 -0.2591439 -0.5333853 -0.0880545 -0.1669114 -0.1261537 -0.7294801 0.1416414 -0.1536894 0.1279569 -0.4615411 -0.7258448 -0.0025823 -0.0241489 0.0308768 -0.2612704 -0.1114075 0.0422142 -0.0657801 -0.691439 -0.4547486 -0.0058244 -0.1271369 -0.0070066 -0.705101 0.1239371 -0.1519146 0.1265205 -0.5885003 -0.8168746 0.2428678 0.0282138 0.2846379 -0.3296272 0.0027721 0.0431024 0.0020844 -0.583185 -0.8387085 0.0497703 -0.0996899 0.1383101 -0.4198239 0.0342046 -0.2390653 0.0124019 -0.3195059 0.327427 -0.0103474 0.0611597 0.0313798 0.4749726 -0.1511632 0.1644587 -0.1065856 0.3001125 0.2393661 -0.0250529 -0.0181432 -0.1010173 0.0210708 0.034821 -0.0959521 0.0259741 0.5105531 0.2327145 -0.0086262 0.0988765 -0.1735131 0.3741342 -0.108037 0.0911715 -0.0870896 0.4273243 -0.0609357 -0.0941716 -0.0758867 -0.1178283 0.6121608 -0.0677918 -0.2148898 -0.1179282 0.2600365 0.55305 -0.2559175 -0.0066911 -0.1668398 0.2039534 0.0739235 -0.0349076 0.0524434 0.3373883 1.0566437 -0.0444804 0.2338702 0.0980504 0.7012301 -0.000983 0.3612661 -0.0002435 0.2193388 0.0468769 -0.0056377 -0.0251618 -0.0022771 -0.0044409 -0.0548969 -0.0049147 -0.0337799 -0.1493285 0.1545782 0.0020872 0.0109715 0.0150718 -0.0200278 0.0682791 0.0395864 0.0114973 0.0015286 0.0693779 -0.0020689 -0.0191413 -0.0063177 -0.0172372 -0.0535359 -0.006081 -0.0226277 -0.1389863 0.0848212 0.0117504 -0.0236408 -0.0274882 0.0096473 0.0005526 0.0134882 0.0384185 -0.1005832 0.0488547 0.0151167 0.0253596 0.0478379 -0.0237383 0.082814 0.0058725 0.1196439 -0.0551793 -0.0158387 0.0425946 0.0133455 0.0558276 -0.042795 -0.0966719 0.0004127 -0.1532137 -0.1102953 0.2867599 0.1240843 0.0374615 0.1171555 0.3634652 -0.0218697 0.0413197 -0.028745 0.2638525 0.3937052 0.0231853 0.0564326 0.0177691 0.1778439 0.0924149 0.027599 0.031629 0.3225359 0.1960332 0.0866176 0.0254047 0.0803367 0.3992449 -0.0076394 0.0415036 -0.0075402 0.3218476 0.0193437 0.0454765 -0.0355226 0.0044967 -0.2295344 0.0253287 -0.0305599 0.0326385 0.0921161 0.1624968 -0.1038972 -0.0090416 -0.1553572 0.1607265 -0.0029119 -0.0143944 -0.0003655 0.4010533 unknown
polarizability: 104.1417386|-0.2583496|74.157953|2.6736343|-4.2135864|65.7751005 unknown
InChI: InChI=1S/C6H11FO5/c7-3(1-8)5(11)6(12)4(10)2-9/h1,3-6,9-12H,2H2
charge 0 multiplicity 1
23 atoms
F  -1.992572 1.445941 0.649372
O  0.480248 1.495938 -0.647024
O  -0.868113 -0.797275 -1.250707
O  2.01824 -1.317188 1.148641
O  4.274549 -0.309216 0.068202
O  -4.165816 -0.110859 -0.086354
C  0.585768 0.406635 0.342164
C  -0.624088 -0.553436 0.170849
C  1.904038 -0.326008 0.069527
C  -1.88983 -0.008133 0.863021
C  3.117036 0.610662 0.087393
C  -3.150955 -0.697687 0.333987
H  0.613263 0.804702 1.376463
H  -0.367296 -1.52925 0.620453
H  1.856956 -0.838008 -0.913838
H  -1.814373 -0.147469 1.961697
H  3.101884 1.272253 -0.797595
H  3.119551 1.221387 1.014533
H  -0.284443 2.071409 -0.379029
H  -0.628928 0.048315 -1.724605
H  2.963203 -1.625939 1.137026
H  -3.077745 -1.81317 0.376846
H  5.120423 0.199797 0.099279
