program: Gaussian 09
title: 000170036
version: EM64L-G09RevD.01
frameworkgroup: C1[X(C14H20O2)]
method: RPBEPBE
basis: SDD
operation: Freq
keyword: #pfreq=noraman
keyword: PBEPBE/SDD
title: #p freq=noraman PBEPBE/SDD
converged: YES YES NO NO
title: Mulliken charges:
elementType: O O C C C C C C C C C C C C C C H H H H H H H H H H H H H H H H H H H H
charge: -0.442935 -0.255279 -0.361316 -0.376085 -0.389220 -0.352170 -0.572039 -0.356182 0.520355 -0.695556 -0.409777 -0.397347 -0.354404 -0.332615 0.246322 0.108920 0.191927 0.193574 0.191868 0.192867 0.213401 0.211658 0.188649 0.188004 0.210799 0.210526 0.195714 0.195444 0.209737 0.209871 0.216180 0.239166 0.237502 0.268321 0.271679 0.382441
chargesum: 0.00000
title: Mulliken charges with hydrogens summed into heavy atoms:
elementType: O O C C C C C C C C C C C C C C
charge: -0.060495 -0.255279 0.024186 0.008650 0.035840 0.024483 -0.150714 0.034977 0.520355 -0.059768 -0.170611 -0.159845 -0.086083 -0.060936 0.246322 0.108920
polarizability: 2.36450897e+02 9.16887721e+00 1.39656051e+02 2.27225865e+01 -1.21433828e+01 1.14262923e+02
1716.lowfreq: -0.0012 -0.0009 -0.0008 3.7833 5.2315 14.1383 15.5083 29.9930 46.4966
frequency: 15.3372 29.9007 45.7077 58.2493 73.0918 80.7944 99.2540 121.2418 133.0166 148.3907 183.9249 201.6293 229.2337 246.8692 331.6933 336.7196 352.4286 405.4915 422.6552 451.1588 487.0303 520.7067 579.1835 595.0857 633.3746 690.6744 710.0023 722.1698 732.5770 762.4148 764.0739 816.3685 824.5832 861.3825 867.3146 890.6122 907.9853 984.1563 990.4719 992.6459 996.6056 1000.9328 1022.3059 1027.6504 1038.9743 1073.4362 1075.5356 1081.3468 1117.1568 1128.5036 1150.6133 1188.4834 1194.0062 1219.2476 1223.1255 1229.7308 1267.2919 1269.1079 1282.0627 1291.3402 1293.8520 1307.7468 1310.0967 1320.3488 1335.1980 1352.8705 1356.4862 1387.5349 1391.0267 1413.0368 1462.0759 1462.9491 1467.4664 1472.2454 1477.4042 1479.4833 1486.4600 1489.9624 1501.2245 1574.9932 1620.5011 1642.5760 2951.6699 2952.1398 2959.1971 2968.0564 2970.9473 2972.1682 2981.2242 2986.2162 2995.4429 3010.9102 3022.6856 3036.0528 3050.9829 3068.4152 3071.5420 3125.8082 3128.4941 3160.0008 3175.7267 3531.3580
redmass: 4.6073 5.1758 2.3069 1.9771 6.4899 4.3637 1.8901 2.0721 4.8335 1.9497 4.8032 4.0093 1.1176 4.1572 3.5150 3.0265 4.6259 2.8582 3.4726 3.1810 5.7450 2.8102 2.7186 1.5156 6.9043 3.7745 3.9942 1.0629 1.0860 1.3403 2.8094 4.5145 1.2200 1.3465 1.6344 1.8606 1.2462 1.9684 2.1141 1.3465 1.3941 3.7604 2.7076 3.1697 3.3943 2.5526 1.3200 2.1927 2.4886 1.2658 1.6931 1.7241 1.1722 2.1978 1.3872 1.4062 1.2561 1.3535 1.0478 1.1296 1.0904 1.3753 1.3697 2.5248 1.4215 1.5456 1.6682 5.0773 1.2171 3.3490 1.0760 1.0702 1.0764 1.0816 1.0433 1.0823 1.0900 1.0967 2.6922 7.1379 6.3592 8.5451 1.0589 1.0589 1.0592 1.0591 1.0585 1.0368 1.0592 1.0969 1.0996 1.1019 1.1032 1.1046 1.1048 1.1007 1.0993 1.0896 1.0896 1.0955 1.0948 1.0641
irintensity: 0.4099 0.0413 0.0401 0.0281 0.8305 0.0122 0.0137 0.0228 0.0866 0.0295 0.9824 0.2209 0.0010 0.0432 1.2847 1.4827 5.4435 0.3820 8.1494 4.4107 8.2953 45.8368 56.3485 52.9559 0.6637 64.8398 25.0406 12.9233 0.0192 3.3562 7.4645 2.2189 1.1022 7.5839 25.4015 11.6453 0.4839 3.5406 9.0818 21.0783 2.2802 185.4154 91.3087 3.9366 1.4478 1.5079 1.9605 0.5283 26.7519 6.8814 131.0110 0.0200 3.3314 0.2314 15.3783 0.1976 0.0492 1.5729 0.7049 0.1232 0.1150 2.9388 19.3313 101.1385 3.3539 0.1789 0.4604 5.0666 11.2809 15.5394 0.0102 0.0380 0.7959 0.4142 12.2285 2.4003 0.3357 30.7075 15.5796 16.7655 92.1178 323.6176 2.3155 0.8042 19.8724 57.8337 52.2927 36.6027 87.9846 0.5794 0.6215 0.3109 1.3012 44.9783 103.2800 97.6631 53.8871 15.2085 12.6748 5.7582 1.9922 45.6393
temp: 298.150 k
press: 1.00000 atm
elementType: 8 8 6 6 6 6 6 6 6 6 6 6 6 6 6 6 1 1 1 1 1 1 1 1 1 1 1 1 1 1 1 1 1 1 1 1
symmnumber: 1
zpe: 806891.0 jmol-1
zpe.correction: 0.307329 hartree
zpe.thermalcorrener: 0.324666 hartree
zpe.thermalcorrenthalpy: 0.325610 hartree
zpe.thermalcorrgfe: 0.259180 hartree
zpe.sumelectzpe: -694.733222 hartree
zpe.sumelectthermal: -694.715884 hartree
zpe.sumelectthermalent: -694.714940 hartree
zpe.sumelectthermalfe: -694.781371 hartree
dipole: 2.6796 -0.9237 1.0917
dipole: 3.0373
quadrupole: -105.6843 -93.7314 -100.0719
quadrupole: 9.9480 -3.2806 -0.2634
quadrupole: -5.8551 6.0978 -0.2427 9.9480 -3.2806 -0.2634
hfenergy: -695.0405505 hartree
pointgroup: C01 [X(C14H20O2)]
dipole: 1.0547119 -0.4920753 0.2708839 debye
polarizability: 236.3451187|0.510587|144.5259998|24.7695014|-0.3259753|109.4987529 unknown
InChI: InChI=1S/C14H20O2/c1-2-3-4-5-6-7-12-8-10-13(11-9-12)14(15)16/h8-11,15H,2-7H2,1H3
charge 0 multiplicity 1
36 atoms
O  -5.468476 -1.313934 -0.824558
O  -5.64545 0.997465 -0.950656
C  3.021317 0.088451 0.706866
C  4.055217 -0.05477 -0.432925
C  1.559754 0.032316 0.210846
C  5.518652 0.006437 0.060277
C  0.52894 0.16084 1.369445
C  6.554148 -0.145476 -1.077413
C  -0.906858 0.106734 0.87681
C  8.013394 -0.084594 -0.576446
C  -1.620755 1.297623 0.574515
C  -1.554876 -1.1401 0.664431
C  -2.935189 1.248215 0.073677
C  -2.869439 -1.20231 0.163876
C  -3.56907 -0.004318 -0.136291
C  -4.956195 -0.012428 -0.662818
H  3.186383 -0.715462 1.454899
H  3.192344 1.047461 1.239508
H  3.886863 -1.016004 -0.962066
H  3.887835 0.745808 -1.183556
H  1.3823 0.842607 -0.524735
H  1.383924 -0.920895 -0.327444
H  5.690381 0.970083 0.584279
H  5.685908 -0.790836 0.814819
H  0.713085 1.114138 1.902137
H  0.713517 -0.655674 2.095282
H  6.387082 0.651404 -1.830863
H  6.381006 -1.108096 -1.600686
H  8.216126 -0.891584 0.152971
H  8.220095 0.879592 -0.074486
H  8.73291 -0.192981 -1.408841
H  -1.138361 2.268605 0.738983
H  -1.020842 -2.068542 0.900635
H  -3.490856 2.163041 -0.157921
H  -3.366108 -2.163584 0.004993
H  -6.395307 -1.24393 -1.178446
