program: Gaussian 09
title: 000170022
version: EM64L-G09RevD.01
frameworkgroup: C1[X(C7H10O3)]
method: RPBEPBE
basis: SDD
operation: Freq
keyword: #pfreq=noraman
keyword: PBEPBE/SDD
title: #p freq=noraman PBEPBE/SDD
converged: YES YES NO NO
title: Mulliken charges:
elementType: O O O C C C C C C C H H H H H H H H H H
charge: -0.259333 -0.412087 -0.239228 -0.118872 -0.097644 -0.195357 -0.489856 -0.463035 -0.439878 0.133115 0.260506 0.242953 0.293687 0.239565 0.240424 0.236756 0.236022 0.234916 0.221035 0.376311
chargesum: 0.00000
title: Mulliken charges with hydrogens summed into heavy atoms:
elementType: O O O C C C C C C C
charge: -0.259333 -0.035776 -0.239228 0.141633 0.145309 0.098330 -0.009866 0.009743 0.016073 0.133115
polarizability: 8.88324814e+01 7.70856361e-01 7.22717553e+01 4.57467030e+00 2.32693252e+00 7.13259346e+01
1716.lowfreq: -0.0012 -0.0008 -0.0007 8.6249 15.4478 21.0141 42.4377 74.1831 175.1734
frequency: 42.4041 74.0829 175.1599 229.7462 321.3624 377.5178 385.1321 507.9431 573.5534 587.0256 613.2194 680.5272 753.1568 756.7360 783.6825 803.5060 828.8288 869.2203 904.5385 933.6154 952.7573 968.8070 1005.1338 1013.3909 1024.0494 1056.3523 1080.7892 1114.9783 1159.0423 1177.5771 1194.5883 1230.4621 1235.2512 1239.2386 1258.1696 1265.4358 1291.3992 1300.9406 1311.6102 1354.0873 1454.5921 1464.2229 1479.3040 1653.1538 3023.4428 3029.9388 3037.7474 3065.2271 3082.9210 3098.0291 3104.9839 3117.0384 3127.2999 3507.7094
redmass: 6.8036 3.2640 4.0538 2.7976 2.6030 3.5678 3.1134 4.2722 3.7269 2.3218 2.2930 2.5892 4.6685 3.2868 3.1032 1.9779 2.7992 2.2455 4.3429 2.1929 4.9038 3.1901 2.3283 1.8595 3.0520 1.7616 2.1838 1.1204 1.1588 1.2240 1.2016 1.2297 1.4434 1.5986 1.4336 1.4070 1.4743 1.4393 1.4631 2.0274 1.0873 1.0875 1.0998 8.0940 1.0586 1.0599 1.0614 1.0864 1.1055 1.1046 1.1051 1.0905 1.0942 1.0639
irintensity: 1.4489 1.6177 0.6083 2.3183 2.3494 5.5621 7.6456 9.2689 33.7179 63.0722 46.7921 54.8243 3.7572 13.5008 22.6954 14.7520 0.5900 22.6025 7.1454 10.8649 27.4458 18.2073 38.1528 19.9832 76.2349 75.4405 118.4089 2.6010 10.6996 31.9692 3.2843 8.1762 2.1043 10.9397 3.5223 0.5366 5.2781 10.9362 4.1947 56.8080 4.0123 14.8825 19.2345 183.1402 25.7895 27.9643 28.6366 3.9551 2.7088 19.7324 25.9999 43.6376 13.4224 25.3339
temp: 298.150 k
press: 1.00000 atm
elementType: 8 8 8 6 6 6 6 6 6 6 1 1 1 1 1 1 1 1 1 1
symmnumber: 1
zpe: 428745.4 jmol-1
zpe.correction: 0.163300 hartree
zpe.thermalcorrener: 0.171805 hartree
zpe.thermalcorrenthalpy: 0.172749 hartree
zpe.thermalcorrgfe: 0.129121 hartree
zpe.sumelectzpe: -497.632937 hartree
zpe.sumelectthermal: -497.624433 hartree
zpe.sumelectthermalent: -497.623489 hartree
zpe.sumelectthermalfe: -497.667116 hartree
dipole: -0.6858 0.4370 -0.0827
dipole: 0.8174
quadrupole: -55.6526 -64.3681 -56.5753
quadrupole: 4.8227 4.8574 -3.8345
quadrupole: 3.2127 -5.5028 2.2901 4.8227 4.8574 -3.8345
hfenergy: -497.7962375 hartree
pointgroup: C01 [X(C7H10O3)]
dipole: 0.2748373 0.0284329 -0.16456 debye
dipolederiv: -0.7002061 0.0136323 0.0364384 0.0021324 -0.5264894 -0.0049896 0.0185072 -0.0031872 -0.5531625 -0.902404 -0.3702838 -0.3783752 -0.4280866 -0.6465558 -0.1937858 -0.3089047 -0.1344098 -0.4237391 -0.6638935 0.0305258 0.1800521 -0.119659 -0.4996953 -0.2067839 0.0911026 -0.3208635 -0.7602427 0.6407593 -0.0283934 0.0169208 -0.250215 0.3678333 0.0008952 0.0757793 -0.0768112 0.3587472 0.3719915 -0.0501734 0.0244716 0.0344788 0.3783411 -0.01675 0.1153063 0.0255979 0.3688024 -0.4593294 0.0334192 0.1032675 0.2122438 -0.0891829 -0.0216085 0.1241483 0.0290365 0.0101314 -0.1085701 0.0595254 -0.0419482 0.0339206 0.0229155 -0.0514349 -0.0647565 -0.0318793 0.0597751 -0.0010688 -0.0567943 -0.0796211 -0.026118 0.0480775 -0.0193331 -0.0341694 -0.0010717 -0.12601 0.1152399 -0.0299566 0.0158121 -0.0433756 -0.0321295 0.1049655 0.000054 0.0499899 -0.0802432 1.4462414 0.3502597 -0.0101711 0.5574593 0.6346256 0.4826232 -0.1400966 0.5242713 0.9121688 0.0334604 -0.0212562 -0.018364 -0.0218913 -0.075497 -0.0551074 -0.0415576 -0.0745413 0.0206177 -0.0776169 -0.101561 0.0302245 -0.0761624 -0.001204 0.0238347 0.0424871 0.0470792 0.0461623 0.0382103 -0.0143434 -0.0397475 -0.0413829 0.0634513 -0.0068445 -0.0507235 -0.0119147 -0.0620029 0.0900641 0.0681125 0.0357296 0.0329583 0.0189989 -0.0467066 0.0241363 -0.1104977 -0.0001216 0.0428811 -0.0153301 -0.0073454 -0.0137889 -0.0094368 0.0942765 -0.0120733 0.1393683 -0.0743901 -0.0455597 -0.0447612 0.1059621 -0.0186266 0.073002 -0.0246861 0.0941555 0.0186961 0.0219424 0.0062714 0.0985943 -0.050541 0.0627757 -0.1020191 0.0661444 -0.0460204 0.0474112 0.0575074 -0.138151 0.0176158 -0.108438 0.054483 0.0511883 0.0313704 -0.0700092 0.0192493 0.0359621 0.0600401 0.0672125 0.0718911 0.0231614 -0.0269639 -0.1019081 0.0198743 -0.0942408 -0.0139233 0.2516401 -0.0060441 0.1137818 0.0256932 0.3507403 -0.0541715 0.1627603 -0.0412825 0.2020187 unknown
polarizability: 88.1796071|5.5353351|72.5075374|0.6899066|2.5882815|71.7430268 unknown
InChI: InChI=1S/C7H10O3/c8-7(9)5-3-4-1-2-6(5)10-4/h4-6,8H,1-3H2
charge 0 multiplicity 1
20 atoms
O  -1.784753 0.488682 0.986067
O  2.714161 0.791824 0.581392
O  2.006662 -0.621921 -1.115845
C  -0.53419 1.0490 0.409437
C  -1.761466 -0.768458 0.163238
C  0.491726 -0.099198 0.778313
C  -0.379205 -1.379908 0.535162
C  -0.833931 1.069978 -1.114728
C  -1.725455 -0.213754 -1.287182
C  1.767978 -0.049078 -0.027406
H  -0.316652 2.01671 0.879864
H  -2.637386 -1.375389 0.428845
H  0.748409 0.021036 1.843005
H  0.032385 -2.005614 -0.274543
H  -0.44647 -1.982344 1.455634
H  0.076656 1.035751 -1.734867
H  -1.394624 1.984018 -1.370125
H  -2.740748 0.046645 -1.629213
H  -1.288619 -0.937078 -1.996329
H  3.529624 0.831496 0.010583
