program: Gaussian 09
title: 000170066
version: EM64L-G09RevD.01
frameworkgroup: C1[X(C13H6F21IO)]
method: RPBEPBE
basis: SDD
operation: Freq
keyword: #p
keyword: freq=noraman
keyword: PBEPBE/SDD
title: #p freq=noraman PBEPBE/SDD
converged: YES YES NO NO
title: Mulliken charges:
elementType: I F F F F F F F F F F F F F F F F F F F F F O C C C C C C C C C C C C C H H H H H H
charge: 0.079259 -0.104835 -0.125225 -0.113703 -0.125127 -0.114534 -0.121324 -0.117024 -0.134522 -0.110431 -0.123927 -0.146903 -0.126746 -0.160838 -0.157457 -0.117580 -0.118284 -0.123145 -0.121971 -0.120107 -0.126871 -0.120528 -0.444066 0.183694 0.277650 0.185929 0.247577 0.232395 0.277109 0.267495 0.267722 -0.419752 0.206437 -0.582087 0.374712 -0.280402 0.323136 0.284537 0.320132 0.231350 0.232903 0.365349
chargesum: 0.00000
title: Mulliken charges with hydrogens summed into heavy atoms:
elementType: I F F F F F F F F F F F F F F F F F F F F F O C C C C C C C C C C C C C
charge: 0.079259 -0.104835 -0.125225 -0.113703 -0.125127 -0.114534 -0.121324 -0.117024 -0.134522 -0.110431 -0.123927 -0.146903 -0.126746 -0.160838 -0.157457 -0.117580 -0.118284 -0.123145 -0.121971 -0.120107 -0.126871 -0.120528 -0.078717 0.183694 0.277650 0.185929 0.247577 0.232395 0.277109 0.267495 0.267722 0.187922 0.206437 -0.261955 0.374712 0.183851
polarizability: 2.11366937e+02 -1.45353029e+01 1.78534718e+02 -1.35520815e+00 5.78946533e+00 1.43214430e+02
1716.lowfreq: -6.4770 -3.9387 -2.1724 -0.0007 -0.0003 0.0002 8.3687 15.1939 23.2321
frequency: -1.6827 14.8918 23.0799 24.5391 34.6119 36.8640 44.8881 54.0463 72.3498 82.5535 89.0508 98.7805 100.9176 112.3355 119.3174 128.2110 133.1764 136.5183 147.8499 154.5741 160.0616 186.5906 187.8382 193.8852 198.7473 204.5426 217.1765 225.9782 240.7247 243.4273 245.3359 251.2969 263.0841 268.1194 277.3128 281.8931 288.1494 292.9103 297.7230 299.6466 302.7080 303.4279 308.7935 320.5700 322.2904 331.5151 336.0406 348.5411 373.9430 396.0800 407.4965 417.5386 430.7843 437.8579 462.0973 482.1198 499.7546 512.4172 516.2319 534.3482 547.3702 565.2335 576.6090 582.1264 584.7648 589.6534 593.7995 616.9363 654.3030 664.3277 754.2546 827.6467 838.9886 858.2446 888.9347 917.7966 947.1652 960.8188 963.5644 982.1777 986.3031 1009.3519 1011.1194 1015.0319 1020.3069 1021.8304 1026.8555 1034.5645 1038.6337 1048.4903 1058.9347 1067.0764 1078.2636 1086.5336 1091.1694 1092.6578 1101.2535 1120.8822 1126.3968 1147.5820 1148.8733 1151.3491 1154.6848 1171.0550 1175.9612 1189.0935 1208.0282 1219.1832 1286.5294 1336.0224 1359.6912 1407.9754 1444.2975 1466.8325 2954.0805 3019.2742 3039.0751 3100.3701 3112.7748 3602.5458
redmass: 17.2477 17.0537 17.9560 18.6925 14.2333 7.6571 14.7540 17.3215 15.0530 9.4820 14.7823 11.6412 11.3162 15.2447 17.3056 15.0612 17.9340 8.9240 15.5142 11.6531 14.7685 12.0414 16.7281 1.5619 11.9813 4.0076 12.9415 14.0260 17.1310 9.2357 13.9845 14.2829 13.2734 17.4255 13.1255 10.5774 16.7340 3.6999 15.1913 16.7583 15.6551 18.0814 12.3784 14.0053 10.1390 18.2756 11.7226 5.7577 7.6886 9.4120 17.7841 13.4154 17.4442 15.2700 17.8367 15.5232 6.5817 13.9681 17.4341 6.6237 11.0712 12.1092 17.0320 12.5431 4.9983 12.9746 10.0205 16.8555 16.8817 4.5842 13.4493 4.2489 6.4492 8.7475 3.9706 7.5215 5.1074 2.4146 6.3401 12.9719 7.7350 9.6378 6.8261 12.1552 11.0598 12.2917 10.5497 12.6133 12.7204 12.3977 7.4975 4.7818 11.7266 11.8411 4.7206 4.5556 2.6200 11.4076 11.5862 10.3103 9.7412 10.1919 1.2227 4.7866 11.0185 12.3279 1.4278 1.1090 1.4833 1.3083 1.3857 1.3869 1.0916 1.0724 1.0588 1.1021 1.0605 1.0923 1.0956 1.0669
irintensity: 0.0645 0.0629 0.1957 0.0234 0.4165 1.5832 0.1777 0.0428 0.0671 1.0454 0.0989 0.2648 0.1117 0.7886 1.5328 1.2888 0.2969 7.1282 0.3149 0.8002 0.7350 31.3177 19.1522 101.1226 11.7434 37.1865 0.7168 12.0045 0.7411 1.1705 0.8998 0.5328 1.3354 0.3220 2.1759 0.5686 1.7400 0.2113 0.1349 0.0646 0.3502 0.1895 0.8319 0.1308 0.6004 0.7010 0.4735 3.5201 10.3152 6.4468 5.9776 5.2665 1.4372 0.9766 8.8837 1.6893 24.7436 26.2318 0.6485 14.1573 15.3013 5.9387 7.2009 14.3332 5.4377 6.9484 22.2278 1.6821 48.9730 8.1024 347.3005 21.2480 5.9794 184.2267 2.9737 1.7310 205.7875 48.2200 63.2801 44.8843 107.9160 132.7479 29.8938 8.1630 85.5200 54.7058 30.7905 0.9696 50.3706 98.4505 190.0256 31.7575 186.8071 375.6442 19.9953 219.1290 107.1289 0.6207 67.6977 2.2386 8.5347 0.3253 16.7867 24.0866 1.7916 46.2146 7.0631 21.4880 28.2205 34.5408 9.7358 0.4869 14.8629 14.7797 32.4618 31.8706 11.0040 1.3073 0.1407 14.1832
temp: 298.150 k
press: 1.00000 atm
elementType: 53 9 9 9 9 9 9 9 9 9 9 9 9 9 9 9 9 9 9 9 9 9 8 6 6 6 6 6 6 6 6 6 6 6 6 6 1 1 1 1 1 1
symmnumber: 1
zpe: 521112.5 jmol-1
zpe.correction: 0.198481 hartree
zpe.thermalcorrener: 0.235219 hartree
zpe.thermalcorrenthalpy: 0.236163 hartree
zpe.thermalcorrgfe: 0.127937 hartree
zpe.sumelectzpe: -2679.497850 hartree
zpe.sumelectthermal: -2679.461113 hartree
zpe.sumelectthermalent: -2679.460169 hartree
zpe.sumelectthermalfe: -2679.568395 hartree
dipole: 2.1855 1.1034 1.3168
dipole: 2.7798
quadrupole: -207.1280 -219.9119 -222.8984
quadrupole: 14.5120 6.6969 2.5298
quadrupole: 9.5181 -3.2658 -6.2523 14.5120 6.6969 2.5298
hfenergy: -2679.6963317 hartree
pointgroup: C01 [X(C13H6F21I1O1)]
dipole: 0.9037919 0.1906141 0.5856148 debye
polarizability: 208.0814059|-16.4535896|175.6622889|-6.0914312|15.3522826|149.3723901 unknown
InChI: InChI=1S/C13H6F21IO/c14-4(15,1-3(35)2-36)5(16,17)6(18,19)7(20,21)8(22,23)9(24,25)10(26,27)11(28,29)12(30,31)13(32,33)34/h3,36H,1-2H2
charge 0 multiplicity 1
42 atoms
I  6.898129 -2.261254 -0.962875
F  0.098044 1.214377 -0.935714
F  -1.090421 -0.598982 -1.655779
F  0.319704 -2.327528 -0.133779
F  1.525624 -1.062273 -1.600138
F  -1.915496 -1.149026 0.979485
F  -0.698188 0.628101 1.741759
F  1.350722 -1.058115 2.015216
F  2.8845 -1.899348 0.558175
F  -2.089145 2.409189 0.254228
F  -3.317888 1.106162 1.672161
F  3.636138 0.307167 2.014734
F  1.913043 1.545566 1.172069
F  2.877099 1.346671 -1.381995
F  4.371851 2.125512 0.155527
F  -4.630235 2.011971 -0.505894
F  -3.098434 1.135371 -1.944701
F  -3.729127 -1.461523 -1.110623
F  -5.441876 -0.179928 -1.913033
F  -6.337459 -1.842202 -0.014041
F  -4.724307 -1.280453 1.471495
F  -6.284615 0.251748 0.854202
O  7.366536 1.112013 -0.564614
C  -0.38001 -0.05298 -0.555195
C  0.852541 -1.03568 -0.352404
C  -1.404953 0.118249 0.625848
C  1.958042 -0.834536 0.761899
C  2.804281 0.491627 0.86985
C  -2.625914 1.1161 0.433397
C  3.742419 0.929687 -0.318568
C  -3.72198 0.940898 -0.693229
C  4.767467 -0.054484 -0.886534
C  -4.583356 -0.378243 -0.807963
C  5.815384 -0.614771 0.102033
C  -5.494589 -0.807953 0.403599
C  6.821329 0.422709 0.603632
H  5.302384 0.498036 -1.679332
H  4.210589 -0.878258 -1.361157
H  5.362701 -1.147213 0.951571
H  6.27828 1.131837 1.265556
H  7.611911 -0.082691 1.192016
H  8.023376 1.793948 -0.282086
