program: Gaussian 09
title: 000170019
version: EM64L-G09RevD.01
frameworkgroup: C1[X(C11H12N2O4S)]
method: RPBEPBE
basis: SDD
operation: Freq
keyword: #p
keyword: freq=noraman
keyword: PBEPBE/SDD
title: #p freq=noraman PBEPBE/SDD
converged: YES YES NO NO
title: Mulliken charges:
elementType: S O O O O N N C C C C C C C C C C C H H H H H H H H H H H H
charge: 0.990290 -0.220175 -0.569000 -0.506673 -0.505198 -0.286653 -0.036581 -0.345542 0.228295 0.175525 0.441768 -0.687704 -0.767259 -0.325620 -0.364657 -0.082171 -0.226424 -0.207125 0.280982 0.260521 0.233127 0.225635 0.239172 0.257710 0.244903 0.313123 0.294772 0.281893 0.282259 0.380807
chargesum: 0.00000
title: Mulliken charges with hydrogens summed into heavy atoms:
elementType: S O O O O N N C C C C C C C C C C C
charge: 0.990290 -0.220175 -0.188193 -0.506673 -0.505198 -0.286653 -0.036581 -0.064560 0.228295 0.175525 0.441768 0.031579 -0.025474 -0.012497 -0.069885 -0.082171 0.055469 0.075134
polarizability: 2.91929348e+02 8.08305869e-01 1.64245115e+02 2.23826409e+00 -2.46675393e+00 9.99711175e+01
1716.lowfreq: -6.2832 -5.0875 -0.0012 0.0012 0.0018 6.9760 24.5859 36.8942 58.9112
frequency: 24.5051 36.8785 58.8982 75.3104 84.5305 115.3859 152.4281 153.1307 168.4351 175.7631 187.8332 207.0299 222.3537 252.4617 270.4024 296.4177 298.4683 324.2371 349.4372 366.8607 390.4478 404.9056 417.9443 464.3110 521.1393 551.9057 556.7945 572.8770 606.1095 617.2041 675.6424 699.7949 736.7285 768.5675 807.6019 832.7657 850.9185 863.5307 893.2650 965.1627 984.0902 987.7874 992.1358 995.4835 1001.3361 1033.8483 1039.8366 1045.5173 1058.5641 1080.8914 1082.4481 1125.0428 1157.5372 1185.2080 1195.0200 1250.9304 1298.5209 1304.1056 1363.1013 1389.1577 1394.6834 1404.6392 1416.0981 1452.3216 1457.6194 1474.8815 1479.9399 1481.8127 1575.1164 1591.5644 1595.1002 1642.7622 2981.8618 2994.3803 2997.2941 3057.1815 3099.7782 3104.6753 3111.7869 3163.0106 3163.7268 3191.9869 3198.8800 3479.8441
redmass: 7.0496 5.0388 3.6603 4.9748 6.3815 4.4350 5.4574 1.2783 1.4595 5.2610 4.7935 1.7055 1.3421 4.5064 3.4398 6.1763 4.9613 9.6533 7.4131 6.6766 5.8711 6.0713 3.0684 8.0579 4.1733 6.2901 6.2591 4.1029 4.3764 7.1208 6.7761 6.0772 3.7945 5.1903 2.6729 12.8433 1.2547 1.5145 3.5206 17.2924 3.6651 1.4465 1.6866 1.5900 1.3405 2.1894 3.4438 1.2773 2.0051 1.8214 2.9129 1.2951 2.7195 1.1914 1.6163 1.5241 1.2974 3.8677 2.6658 6.8838 1.2441 1.5872 3.3730 1.1248 1.0475 1.1082 1.2127 1.8628 6.1238 7.5074 5.8902 11.6311 1.0382 1.0813 1.0346 1.0967 1.1015 1.1010 1.0985 1.0912 1.0912 1.0956 1.0947 1.0661
irintensity: 1.7962 0.5758 0.9505 2.7303 0.3761 0.0392 12.4386 3.1585 46.2238 3.7885 2.0717 0.0525 0.7596 7.4239 47.7705 9.5913 23.3544 21.0448 6.7182 53.4820 3.3307 4.4662 0.2604 24.5905 46.7507 53.5419 96.6774 62.8123 2.3934 0.5143 17.2426 28.2988 0.2168 9.0649 0.8853 97.4357 2.7362 73.5268 22.7839 86.7156 5.9806 5.2030 4.0165 10.1753 0.5141 8.8868 33.8461 49.7144 109.6374 1.8710 13.0921 15.2913 17.1663 26.8147 12.4273 3.6828 12.9543 182.9180 104.8947 0.7398 9.0902 26.8970 19.2096 20.1310 22.4165 40.3807 21.8047 153.1036 6.1552 14.5829 195.1481 190.3066 18.4425 2.3213 26.8045 12.0021 22.8520 10.8380 7.7420 1.1334 4.6641 6.0425 0.0869 41.3113
temp: 298.150 k
press: 1.00000 atm
elementType: 16 8 8 8 8 7 7 6 6 6 6 6 6 6 6 6 6 6 1 1 1 1 1 1 1 1 1 1 1 1
symmnumber: 1
zpe: 568823.7 jmol-1
zpe.correction: 0.216653 hartree
zpe.thermalcorrener: 0.234922 hartree
zpe.thermalcorrenthalpy: 0.235866 hartree
zpe.thermalcorrgfe: 0.169387 hartree
zpe.sumelectzpe: -1233.321623 hartree
zpe.sumelectthermal: -1233.303354 hartree
zpe.sumelectthermalent: -1233.302410 hartree
zpe.sumelectthermalfe: -1233.368889 hartree
dipole: 8.5470 2.1032 1.4058
dipole: 8.9135
quadrupole: -96.6891 -118.5744 -115.9554
quadrupole: 7.2478 -11.0506 1.0373
quadrupole: 13.7172 -8.1681 -5.5491 7.2478 -11.0506 1.0373
hfenergy: -1233.5382764 hartree
pointgroup: C01 [X(C11H12N2O4S1)]
dipole: 3.3939875 0.7530967 0.4600284 debye
polarizability: 291.8683769|-3.4108479|163.5893559|0.2839652|-7.3083552|100.6878484 unknown
InChI: InChI=1S/C11H12N2O4S/c1-7-8(2)12-13(11(7)14)9-3-5-10(6-4-9)18(15,16)17/h3-7,15H,1-2H3
charge 0 multiplicity 1
30 atoms
S  -4.370289 0.26111 -0.167803
O  2.199456 -2.297184 0.455117
O  -4.659938 0.530974 1.65214
O  -4.835433 1.595986 -0.956877
O  -4.978602 -1.184106 -0.569471
N  1.67543 0.016124 0.114239
N  2.403139 1.251152 -0.049546
C  3.959743 -0.510886 0.274016
C  3.689902 0.9637 0.037226
C  2.535385 -1.09437 0.30596
C  0.257944 0.05913 0.054125
C  4.851794 -1.208093 -0.784219
C  4.732957 2.03035 -0.094515
C  -0.505048 -1.134773 0.192489
C  -0.385031 1.310974 -0.152155
C  -2.512892 0.181358 -0.066391
C  -1.910176 -1.070425 0.134964
C  -1.788432 1.376325 -0.209993
H  4.417809 -0.660129 1.272685
H  4.85614 -2.294847 -0.594722
H  4.467207 -1.036286 -1.804354
H  5.889418 -0.836049 -0.731013
H  5.370088 2.075423 0.808855
H  4.260802 3.014147 -0.245186
H  5.402086 1.824467 -0.95113
H  0.001442 -2.089613 0.344758
H  0.222798 2.210661 -0.260334
H  -2.518757 -1.974907 0.228762
H  -2.305283 2.326104 -0.377332
H  -5.650158 0.592981 1.789505
