program: Gaussian 09
title: 000169999
version: EM64L-G09RevD.01
frameworkgroup: C1[X(C9H9ClO4)]
method: RPBEPBE
basis: SDD
operation: Freq
keyword: #p
keyword: freq=noraman
keyword: PBEPBE/SDD
title: #p freq=noraman PBEPBE/SDD
converged: YES YES NO NO
title: Mulliken charges:
elementType: Cl O O O O C C C C C C C C C H H H H H H H H H
charge: -0.016694 -0.395671 -0.240506 -0.408554 -0.248457 0.470329 0.053441 0.334705 -0.670163 0.456045 -0.567935 -0.817583 0.144274 -0.498960 0.234457 0.273033 0.220298 0.235761 0.358105 0.368092 0.243521 0.233911 0.238550
chargesum: 0.00000
title: Mulliken charges with hydrogens summed into heavy atoms:
elementType: Cl O O O O C C C C C C C C C
charge: -0.016694 -0.037567 -0.240506 -0.040462 -0.248457 0.470329 0.053441 0.334705 -0.435706 0.456045 -0.567935 -0.088489 0.144274 0.217022
polarizability: 1.71340900e+02 -6.59359179e-02 1.42111614e+02 -3.46082619e+00 -3.98288665e-01 6.30772319e+01
1716.lowfreq: -4.0226 -0.0022 -0.0004 0.0010 2.2972 6.5599 47.9719 63.8339 91.2244
frequency: 47.9558 63.8310 91.2230 96.7374 106.2367 131.0559 178.1448 197.5831 218.7670 250.6546 279.1525 284.5670 304.5845 311.7033 341.8460 372.4881 389.2522 421.9997 464.3573 551.4208 568.2138 576.4333 592.5736 618.4106 661.3109 709.6478 767.2475 783.9443 817.1078 908.7869 983.1792 1009.1769 1045.5724 1048.5826 1066.6996 1109.9138 1148.6073 1172.1575 1186.2209 1235.5391 1255.8656 1339.1515 1384.7651 1407.6095 1418.9317 1424.1314 1451.9861 1457.1919 1461.6174 1471.3773 1494.2999 1586.5569 1612.2413 1616.8772 2992.7956 3002.9558 3076.5099 3098.8089 3104.0279 3125.0217 3149.7533 3470.1374 3583.9817
redmass: 5.3403 5.6538 1.9621 4.4214 1.5455 1.1539 5.0102 5.4900 7.9283 5.5094 4.5914 4.1574 6.5691 4.6970 4.8537 1.2133 6.3550 3.6398 1.2894 6.6321 4.6339 4.6764 5.7271 5.6430 5.9837 5.1948 6.2701 6.1683 1.6539 7.5704 2.5717 7.2708 1.5590 2.1086 7.3871 1.2660 1.4801 1.8003 1.6069 1.5204 2.5471 8.6397 4.7808 1.2712 1.4248 2.8466 1.0511 1.0669 1.0528 1.3298 2.4374 7.3975 9.0986 6.6093 1.0373 1.0295 1.0963 1.1005 1.1044 1.0914 1.1046 1.0646 1.0662
irintensity: 3.9929 0.7530 1.5041 1.2658 0.2435 0.5363 6.4958 1.4250 2.0116 3.4545 7.7187 5.0532 10.4133 13.0795 3.7009 109.2423 17.7261 35.7998 112.2996 10.1428 4.3898 9.6325 9.2811 5.7510 31.7455 14.3965 1.3653 11.1856 33.7491 11.5837 60.4642 14.5430 7.8077 146.2316 99.2694 0.4837 33.9799 416.8780 87.2073 56.1413 92.7018 61.3852 37.0779 19.7801 31.6977 25.6509 12.8344 36.9846 11.1181 83.9947 12.0446 14.2166 259.9128 174.9908 18.6955 39.5193 14.4739 14.4654 25.1450 12.5450 15.6832 60.8604 60.6169
temp: 298.150 k
press: 1.00000 atm
elementType: 17 8 8 8 8 6 6 6 6 6 6 6 6 6 1 1 1 1 1 1 1 1 1
symmnumber: 1
zpe: 431250.7 jmol-1
zpe.correction: 0.164255 hartree
zpe.thermalcorrener: 0.178817 hartree
zpe.thermalcorrenthalpy: 0.179761 hartree
zpe.thermalcorrgfe: 0.122484 hartree
zpe.sumelectzpe: -1108.264297 hartree
zpe.sumelectthermal: -1108.249735 hartree
zpe.sumelectthermalent: -1108.248791 hartree
zpe.sumelectthermalfe: -1108.306068 hartree
dipole: 0.5553 1.6422 -1.2754
dipole: 2.1522
quadrupole: -84.6301 -72.2275 -92.0473
quadrupole: 11.7641 4.9978 -3.0905
quadrupole: -1.6618 10.7408 -9.0790 11.7641 4.9978 -3.0905
hfenergy: -1108.4285519 hartree
pointgroup: C01 [X(C9H9Cl1O4)]
dipole: -0.2977369 -0.6848712 -0.3990783 debye
dipolederiv: -0.3470769 0.2395551 -0.0356471 0.3388876 -0.4912466 0.0477926 -0.0478254 0.0337211 -0.0231144 -0.2334288 -0.3482551 0.0142985 -0.2132424 -1.1678508 0.0064734 -0.0033683 -0.0152568 -0.3547182 -1.0493734 -0.3032037 0.2469687 -0.4850391 -0.5517302 0.3121278 0.5308069 0.3860872 -0.6707673 -1.503476 -0.2794556 -0.0426888 -0.2115235 -0.1077554 -0.0407102 -0.0617512 -0.0447501 -0.3991158 -0.8931611 0.1446618 -0.265563 0.0388364 -0.5064365 0.2400785 -0.0197682 0.2721537 -0.6664468 0.4857452 -0.0825146 0.0353105 0.1432536 0.4154689 -0.0251156 -0.0872062 -0.056329 0.0366353 -0.7078246 0.0849549 -0.012342 -0.2091638 -0.4022759 0.0426974 -0.0210982 0.058319 -0.1555301 0.4171893 0.3346602 -0.0064398 0.2082003 0.9552495 0.0174616 0.114755 0.0180527 0.150001 -0.6216448 0.0544232 -0.0222875 0.3078233 -0.1765791 0.0055143 -0.0300142 0.0031119 -0.2681027 1.3555147 0.4145505 0.0452472 0.1361641 0.3349864 0.0014486 0.0743143 0.0094364 0.1796156 -0.0045231 -0.700149 0.0475474 -0.7270582 0.3373486 -0.0762719 0.0546299 -0.0720879 -0.162495 -0.0582726 0.1949876 -0.0316283 0.1126483 -0.0387873 0.0254067 -0.0442933 0.0464549 0.0049991 1.8007683 0.0990277 0.05616 0.4574489 0.6633844 -0.5988999 -0.370619 -0.6347314 1.028861 0.6449524 0.1617642 -0.1255087 0.0928021 0.2938394 -0.009035 -0.1074414 -0.018069 0.2678168 -0.00225 -0.0614526 -0.0047156 -0.0802658 -0.0684892 0.0144149 -0.0014887 0.0129139 0.1772515 0.0808273 0.0422883 -0.0757402 0.0277292 0.0817881 -0.0291253 -0.0695575 0.0151101 -0.0048085 -0.0058068 -0.1766287 0.0041109 -0.0599555 -0.0860138 0.0029784 -0.0039255 -0.0195021 0.1136036 0.0010656 0.0464266 0.1023613 0.0227485 0.0510611 0.0268246 0.1166297 -0.0217984 -0.011115 0.2391705 0.1203977 -0.0116531 0.0585485 0.3758558 0.0033257 -0.0080673 0.0087795 0.3537214 0.44399 0.0775986 -0.0048034 0.0414232 0.081676 0.0283976 0.0025147 0.0333341 0.3831227 -0.0359827 -0.0523409 0.0228509 -0.0416569 0.0430218 -0.0623009 -0.0742571 -0.1113401 -0.054461 0.050149 -0.0218069 0.016728 -0.0699299 0.0292675 0.1075789 0.0689334 0.1109494 -0.0235186 -0.0565516 0.0105105 0.047434 0.1113211 -0.065783 -0.0410622 -0.0119023 -0.0145592 0.0985656 unknown
polarizability: 170.969891|-3.0672304|140.679541|3.0366579|-12.0058777|64.8803137 unknown
InChI: InChI=1S/C9H9ClO4/c1-4-3-5(11)7(10)8(12)6(4)9(13)14-2/h3,11-12H,1-2H3
charge 0 multiplicity 1
23 atoms
Cl -2.772605 2.179532 -0.318768
O  0.24938 2.137773 -0.08559
O  2.512891 0.723296 -0.862821
O  -3.690355 -0.671167 -0.195975
O  2.759241 -0.700458 0.957102
C  -0.055504 -1.569182 0.128612
C  0.529038 -0.269439 0.04113
C  -0.316902 0.87004 -0.090388
C  -1.457916 -1.708437 0.0418
C  -2.301277 -0.581154 -0.108964
C  -1.720893 0.699261 -0.165417
C  0.797339 -2.81393 0.294695
C  2.014151 -0.116317 0.129496
C  3.970887 0.983916 -0.803232
H  -1.901646 -2.710352 0.090723
H  1.352469 -2.784866 1.247616
H  0.174016 -3.72323 0.269217
H  1.558106 -2.895177 -0.503037
H  -0.466067 2.825971 -0.167072
H  -3.986145 -1.613281 -0.132806
H  4.229843 1.474724 0.150031
H  4.168498 1.646591 -1.657107
H  4.534952 0.039687 -0.888845
