program: Gaussian 09
title: 000170013
version: EM64L-G09RevD.01
frameworkgroup: C1[X(C13H13NO3S)]
method: RPBEPBE
basis: SDD
operation: Freq
keyword: #p
keyword: freq=noraman
keyword: PBEPBE/SDD
title: #p freq=noraman PBEPBE/SDD
converged: YES YES NO NO
title: Mulliken charges:
elementType: S O O O N C C C C C C C C C C C C C H H H H H H H H H H H H H
charge: 0.983282 -0.569279 -0.507647 -0.510837 -0.441156 -0.486042 0.513012 0.408943 0.010561 -0.452678 -0.368889 -0.288914 -0.196404 -0.379981 -0.430586 -0.221113 -0.220095 -0.234001 0.226207 0.228813 0.320105 0.280310 0.249868 0.282075 0.236050 0.253772 0.237047 0.231944 0.231627 0.234185 0.379819
chargesum: 0.00000
title: Mulliken charges with hydrogens summed into heavy atoms:
elementType: S O O O N C C C C C C C C C C C C C
charge: 0.983282 -0.189459 -0.507647 -0.510837 -0.121051 -0.031022 0.513012 0.408943 0.010561 -0.172368 -0.119021 -0.006839 0.039646 -0.126209 -0.193539 0.010830 0.011532 0.000184
polarizability: 2.68455216e+02 -1.55341008e+01 1.69405645e+02 -1.37302091e+01 -6.45483220e+00 1.23463849e+02
1716.lowfreq: -8.7174 -5.9090 -0.0017 -0.0010 0.0016 6.9350 16.9319 24.5114 40.3881
frequency: 16.8344 23.7301 39.7555 42.8228 76.1401 111.0590 124.3949 157.9472 170.6793 199.3402 220.6553 233.4855 258.4998 271.5609 312.0485 330.1052 354.1035 398.4175 416.6082 425.3516 441.3778 444.0124 517.3103 526.4050 533.3123 588.1728 616.9865 624.2367 664.7314 679.3019 704.4552 754.5197 777.2646 810.3151 833.8732 856.2127 865.0326 870.7603 879.3059 921.5379 959.3231 967.3521 972.6912 979.5051 986.1705 991.2708 1000.5108 1026.5374 1049.2906 1059.8023 1083.2908 1088.7667 1108.2408 1174.3234 1179.8605 1186.4516 1208.2191 1221.2795 1261.9576 1310.9902 1326.0191 1346.2319 1370.7305 1386.7602 1436.4403 1442.0270 1471.2632 1483.5801 1492.4901 1506.9708 1566.0793 1595.9638 1616.1002 1630.0246 2935.6166 2978.0014 3122.9033 3125.1176 3138.5314 3142.0979 3144.7907 3150.7183 3167.0111 3167.4814 3183.9587 3479.9943 3564.0391
redmass: 4.0252 7.6608 5.2493 5.0198 4.0943 6.3048 5.8073 1.5910 6.0869 3.7651 3.6889 5.6097 5.5924 3.5437 3.8537 9.7813 4.6080 2.1233 1.3646 7.9063 3.8964 3.2881 3.4686 5.9821 9.3878 6.3998 6.3580 5.6424 5.9292 2.1674 1.9442 1.6687 1.4141 4.9872 9.4823 1.2503 3.2218 1.7951 1.4094 1.3939 6.4126 9.3539 1.3711 1.3934 1.9960 3.7856 1.3354 2.1917 1.3859 2.0074 1.7583 1.5719 2.6405 1.0548 1.0909 1.1103 1.2480 2.0270 1.4071 1.3961 1.3639 2.0630 2.3749 5.5301 3.3647 2.1737 1.8526 2.0970 1.3585 2.4741 4.7886 6.1334 6.1713 6.9157 1.0587 1.1019 1.0871 1.0875 1.0913 1.0921 1.0871 1.0961 1.0935 1.1015 1.0973 1.0661 1.0775
irintensity: 0.2394 1.1528 0.9163 0.1068 1.1987 0.4509 0.3247 53.1354 3.0256 15.4537 3.6965 4.5230 10.9379 40.3758 16.4835 5.4391 5.1957 27.9874 92.0220 61.8070 3.9062 11.6965 22.0457 4.5256 128.1301 42.7693 0.1431 2.1791 9.5140 35.5825 43.9649 52.6627 51.7705 5.7631 79.4338 0.0666 8.1228 15.9084 12.9683 4.6382 20.7806 87.8796 0.9403 0.1177 2.8954 2.2241 0.4723 10.4524 44.6163 33.6318 12.0252 8.4166 26.9543 0.0375 2.3884 2.5424 4.2572 3.5357 11.2552 19.9221 12.1906 46.3207 38.5817 6.8143 23.5723 13.7484 1.9237 62.2996 105.3006 177.9644 65.3186 0.9213 8.2324 292.6973 51.3842 25.5901 7.2564 3.3839 11.3736 6.9436 14.9051 33.8458 11.9424 20.5647 10.8099 39.6923 59.1364
temp: 298.150 k
press: 1.00000 atm
elementType: 16 8 8 8 7 6 6 6 6 6 6 6 6 6 6 6 6 6 1 1 1 1 1 1 1 1 1 1 1 1 1
symmnumber: 1
zpe: 609374.4 jmol-1
zpe.correction: 0.232098 hartree
zpe.thermalcorrener: 0.249664 hartree
zpe.thermalcorrenthalpy: 0.250608 hartree
zpe.thermalcorrgfe: 0.183847 hartree
zpe.sumelectzpe: -1180.189973 hartree
zpe.sumelectthermal: -1180.172407 hartree
zpe.sumelectthermalent: -1180.171463 hartree
zpe.sumelectthermalfe: -1180.238225 hartree
dipole: 6.3467 1.7734 1.4733
dipole: 6.7525
quadrupole: -116.2256 -105.7821 -116.8329
quadrupole: -4.6443 -13.0836 -5.7031
quadrupole: -3.2787 7.1648 -3.8860 -4.6443 -13.0836 -5.7031
hfenergy: -1180.4220712 hartree
pointgroup: C01 [X(C13H13N1O3S1)]
dipole: -2.4935295 0.8627358 -0.3094343 debye
polarizability: 268.1712755|16.5197518|163.6602057|-15.383527|15.2426805|129.4932289 unknown
InChI: InChI=1S/C13H13NO3S/c15-18(16,17)13-8-4-7-12(9-13)14-10-11-5-2-1-3-6-11/h1-9,14-15H,10H2
charge 0 multiplicity 1
31 atoms
S  4.28325 -1.028241 -0.143868
O  4.391462 -1.103224 -2.000851
O  5.671072 -0.408319 0.411758
O  3.75882 -2.462568 0.393911
N  -0.779235 0.229268 0.185116
C  -1.950764 1.112614 0.298419
C  0.53008 0.684695 0.103312
C  -3.244193 0.322805 0.149588
C  2.904583 0.2397 -0.071347
C  1.602856 -0.256411 0.020926
C  0.852385 2.078577 0.090556
C  3.262332 1.597889 -0.090197
C  2.189399 2.514758 -0.003925
C  -3.506624 -0.402973 -1.041997
C  -4.206713 0.309518 1.188102
C  -4.709626 -1.127889 -1.189056
C  -5.414704 -0.411112 1.040706
C  -5.668265 -1.132379 -0.147931
H  -1.891468 1.884893 -0.497092
H  -1.948836 1.651625 1.270302
H  -0.944171 -0.771917 0.291138
H  1.421021 -1.336844 0.041439
H  0.055969 2.823923 0.170169
H  4.306234 1.915205 -0.147202
H  2.402109 3.588997 -0.006976
H  -2.769891 -0.392145 -1.854424
H  -4.010787 0.86234 2.114918
H  -4.902804 -1.682555 -2.113956
H  -6.151612 -0.412317 1.851324
H  -6.602727 -1.692471 -0.263275
H  5.16125 -1.702942 -2.226787
